{"text_format":"1","workbook":"xlsx","n_sheets":12,"sheets":["Vis Ark","Indtast","Data","Tidsskema","Kopiark","6 omg 7.30-12","6 omg 11.30-16","6 omg 7.30-16","12 omg. 7.30-12","12 omg 11.30-16","12 omg 7.30-16","Tidsskema kopi"],"not_rendered":{"charts":12,"images":9,"macros":1,"external_links":0,"defined_names":4,"comments":0,"pivot_tables":0},"unopened":[{"sheet":"6 omg 7.30-12","index":5,"reason":"not_a_worksheet"},{"sheet":"6 omg 11.30-16","index":6,"reason":"not_a_worksheet"},{"sheet":"6 omg 7.30-16","index":7,"reason":"not_a_worksheet"},{"sheet":"12 omg. 7.30-12","index":8,"reason":"not_a_worksheet"},{"sheet":"12 omg 11.30-16","index":9,"reason":"not_a_worksheet"},{"sheet":"12 omg 7.30-16","index":10,"reason":"not_a_worksheet"}],"bounds":{"document_bytes":16777216,"sheet_cells":100000,"rows_first":2000,"rows_last":500,"rows_between":2000,"halvings":0,"cell_chars":16384,"cell_head_chars":4096},"cells_cut":0,"cells_raw":0,"read":"whole","date_system":"1900"}

{"sheet":"Vis Ark","index":0,"n_rows":9,"n_cols":5,"rows_kept":9,"cut":false,"hidden":true,"merged":[[0,0,0,4],[9,0,11,4],[3,2,3,4]]}
["Vis markerede ark:"]
[]
[]
[]
[null,"Helt ark","7.30-12.00","11.30-16.00","7.30-16.00"]
["Data"]
["Indtast"]
["6 omgange"]
["12 omgange"]

{"sheet":"Indtast","index":1,"n_rows":33,"n_cols":20,"rows_kept":33,"cut":false,"hidden":false,"merged":[[24,0,24,7],[4,0,4,7],[6,0,6,7],[8,0,8,7],[26,0,26,7],[10,0,10,7],[12,0,12,7],[14,0,14,7],[16,0,16,7],[0,2,0,4],[50,0,50,7],[34,0,34,7],[36,0,36,7],[38,0,38,7],[40,0,40,7],[42,0,42,7],[44,0,44,7],[46,0,46,7],[48,0,48,7],[28,0,28,7],[30,0,30,7],[32,0,32,7],[18,0,18,7],[20,0,20,7],[22,0,22,7]]}
["Klasse\nbetegnelser:","Start kl. ","Gennemsnits hastighed",null,null,"Antal omgange","Km. pr omgang","Km. ialt","Km. omgang","Km. omgang","Km. omgang","Km. omgang","Km. omgang","Km. omgang","Km. omgang","Km. omgang","Km. omgang","Km. omgang","Km. omgang","Km. omgang"]
[null,null,"Høj","Mel","Lav",null,null,null,1,2,3,4,5,6,7,8,9,10,11,12]
[]
["U11","08:05:00",30,29,28,1,15,{"$f":"IF($G4<>\"\",$F4*$G4,)","v":15},{"$f":"IF(I$2<=$F4,I$2*$G$4,\"\")","v":15},"","","","","","","","","","",""]
["Km. â"]
["U13","08:02:00",32,31,30,2,15,{"$f":"IF($G6<>\"\",$F6*$G6,)","v":30},{"$f":"IF(I$2<=$F6,I$2*$G$6,\"\")","v":15},{"$f":"IF(J$2<=$F6,J$2*$G$6,\"\")","v":30},"","","","","","","","","",""]
["Km. â"]
["U15 + U16P","08:00:00",35,34,33,3,15,{"$f":"IF($G8<>\"\",$F8*$G8,)","v":45},{"$f":"IF(I$2<=$F8,I$2*$G$8,\"\")","v":15},{"$f":"IF(J$2<=$F8,J$2*$G$8,\"\")","v":30},45,"","","","","","","","",""]
["Km. â"]
["U17 + DJUN","09:15:00",40,39,38,5,15,{"$f":"IF($G10<>\"\",$F10*$G10,)","v":75},{"$f":"IF(I$2<=$F10,I$2*$G$10,\"\")","v":15},30,45,60,75,"","","","","","",""]
["Km. â"]
["U19","09:30:00",44,43,42,6,15,{"$f":"IF($G12<>\"\",$F12*$G12,)","v":90},{"$f":"IF(I$2<=$F12,I$2*$G$12,\"\")","v":15},30,45,60,75,90,"","","","","",""]
["Km. â"]
["D","09:35:00",42,41,40,6,15,{"$f":"IF($G14<>\"\",$F14*$G14,)","v":90},{"$f":"IF(I$2<=$F14,I$2*$G$14,\"\")","v":15},30,45,60,75,90,"","","","","",""]
["Km. â"]
["C","09:33:00",43,42,41,8,15,{"$f":"IF($G16<>\"\",$F16*$G16,)","v":120},{"$f":"IF(I$2<=$F16,I$2*$G$16,\"\")","v":15},{"$f":"IF(J$2<=$F16,J$2*$G$16,\"\")","v":30},45,60,75,90,105,120,"","","",""]
["Km. â"]
["B","15:17:00",44,43,42,8,15,{"$f":"IF($G18<>\"\",$F18*$G18,)","v":120},{"$f":"IF(I$2<=$F18,I$2*$G$18,\"\")","v":15},{"$f":"IF(J$2<=$F18,J$2*$G$18,\"\")","v":30},45,60,75,90,105,120,"","","",""]
["Km. â"]
["H40","12:30:00",42,41,40,8,15,{"$f":"IF($G20<>\"\",$F20*$G20,)","v":120},{"$f":"IF(I$2<=$F20,I$2*$G$20,\"\")","v":15},{"$f":"IF(J$2<=$F20,J$2*$G$20,\"\")","v":30},45,60,75,90,105,120,"","","",""]
["Km. â"]
["H50","12:32:00",39,38,37,8,15,{"$f":"IF($G22<>\"\",$F22*$G22,)","v":120},{"$f":"IF(I$2<=$F22,I$2*$G$22,\"\")","v":15},30,45,60,75,90,105,120,"","","",""]
["Km. â"]
["H60","12:34:00",38,37,36,7,15,{"$f":"IF($G24<>\"\",$F24*$G24,)","v":105},{"$f":"IF(I$2<=$F24,I$2*$G24,\"\")","v":15},30,45,60,75,90,105,"","","","",""]
["Km. â"]
["H70","12:36:00",37,36,35,7,15,{"$f":"IF($G26<>\"\",$F26*$G26,)","v":105},{"$f":"IF(I$2<=$F26,I$2*$G26,\"\")","v":15},30,45,60,75,90,105,"","","","",""]
["Km. â"]
["DA","09:33:00",43,42,41,9,15,{"$f":"IF($G28<>\"\",$F28*$G28,)","v":135},{"$f":"IF(I$2<=$F28,I$2*$G28,\"\")","v":15},30,45,60,75,90,105,120,135,"","",""]
["Km. â"]
["DB","09:15:00",38,37,36,5,15,{"$f":"IF($G30<>\"\",$F30*$G30,)","v":75},{"$f":"IF(I$2<=$F30,I$2*$G30,\"\")","v":15},30,45,60,75,"","","","",{"$f":"IF(R$2<=$F30,R$2*$G30,\"\")","v":""},{"$f":"IF(S$2<=$F30,S$2*$G30,\"\")","v":""},{"$f":"IF(T$2<=$F30,T$2*$G30,\"\")","v":""}]
["Km. â"]
["A","15:15:00",46,45,44,13,15,{"$f":"IF($G32<>\"\",$F32*$G32,)","v":195},{"$f":"IF(I$2<=$F32,I$2*$G32,\"\")","v":15},30,45,60,75,90,105,120,135,150,165,180]
["Km. â"]

{"sheet":"Data","index":2,"n_rows":76,"n_cols":16,"rows_kept":76,"cut":false,"hidden":false,"merged":[]}
["Klasse","Start","1. omgang","2. omgang","3. omgang","4. omgang","5. omgang","6. omgang","7. omgang","8. omgang","9. omgang","10. omgang","11. omgang","12. omgang",6.9444445000000005E-4,"Gnms.fart"]
[]
[]
[]
["U15 + U16P Lav","08:00:00","08:27:00","08:55:00","09:22:00",null,null,null,null,null,null,null,null,null,null,33]
["U15 + U16P Mel","08:00:00","08:26:00","08:53:00","09:19:00",null,null,null,null,null,null,null,null,null,null,34]
["U15 + U16P Høj","08:00:00","08:26:00","08:51:00","09:17:00",null,null,null,null,null,null,null,null,null,null,35]
["U13 Lav","08:02:00","08:32:00","09:02:00",null,null,null,null,null,null,null,null,null,null,null,30]
["U13 Mel","08:02:00","08:31:00","09:00:00",null,null,null,null,null,null,null,null,null,null,null,31]
["U13 Høj","08:02:00","08:30:00","08:58:00",null,null,null,null,null,null,null,null,null,null,null,32]
["U11 Lav","08:05:00","08:37:00",null,null,null,null,null,null,null,null,null,null,null,null,28]
["U11 Mel","08:05:00","08:36:00",null,null,null,null,null,null,null,null,null,null,null,null,29]
["U11 Høj","08:05:00","08:35:00",null,null,null,null,null,null,null,null,null,null,null,null,30]
["U17 + DJUN Lav","09:15:00","09:39:00","10:02:00","10:26:00","10:50:00","11:13:00",null,null,null,null,null,null,null,null,38]
["U17 + DJUN Mel","09:15:00","09:38:00","10:01:00","10:24:00","10:47:00","11:10:00",null,null,null,null,null,null,null,null,39]
["U17 + DJUN Høj","09:15:00","09:38:00","10:00:00","10:23:00","10:45:00","11:08:00",null,null,null,null,null,null,null,null,40]
["DB Lav","09:15:00","09:40:00","10:05:00","10:30:00","10:55:00","11:20:00",null,null,null,null,null,null,null,null,36]
["DB Mel","09:15:00","09:39:00","10:04:00","10:28:00","10:52:00","11:17:00",null,null,null,null,null,null,null,null,37]
["DB Høj","09:15:00","09:39:00","10:02:00","10:26:00","10:50:00","11:13:00",null,null,null,null,null,null,null,null,38]
["U19 Lav","09:30:00","09:51:00","10:13:00","10:34:00","10:56:00","11:17:00","11:39:00",null,null,null,null,null,null,null,42]
["U19 Mel","09:30:00","09:51:00","10:12:00","10:33:00","10:54:00","11:15:00","11:36:00",null,null,null,null,null,null,null,43]
["U19 Høj","09:30:00","09:50:00","10:11:00","10:31:00","10:52:00","11:12:00","11:33:00",null,null,null,null,null,null,null,44]
["C Lav","09:33:00","09:55:00","10:17:00","10:39:00","11:01:00","11:23:00","11:45:00","12:07:00","12:29:00",null,null,null,null,null,41]
["C Mel","09:33:00","09:54:00","10:16:00","10:37:00","10:59:00","11:20:00","11:42:00","12:03:00","12:24:00",null,null,null,null,null,42]
["C Høj","09:33:00","09:54:00","10:15:00","10:36:00","10:57:00","11:18:00","11:39:00","12:00:00","12:20:00",null,null,null,null,null,43]
["DA Lav","09:33:00","09:55:00","10:17:00","10:39:00","11:01:00","11:23:00","11:45:00","12:07:00","12:29:00","12:51:00",null,null,null,null,41]
["DA Mel","09:33:00","09:54:00","10:16:00","10:37:00","10:59:00","11:20:00","11:42:00","12:03:00","12:24:00","12:46:00",null,null,null,null,42]
["DA Høj","09:33:00","09:54:00","10:15:00","10:36:00","10:57:00","11:18:00","11:39:00","12:00:00","12:20:00","12:41:00",null,null,null,null,43]
["D Lav","09:35:00","09:58:00","10:20:00","10:43:00","11:05:00","11:28:00","11:50:00",null,null,null,null,null,null,null,40]
["D Mel","09:35:00","09:57:00","10:19:00","10:41:00","11:03:00","11:25:00","11:47:00",null,null,null,null,null,null,null,41]
["D Høj","09:35:00","09:56:00","10:18:00","10:39:00","11:01:00","11:22:00","11:44:00",null,null,null,null,null,null,null,42]
["H40 Lav","12:30:00","12:53:00","13:15:00","13:38:00","14:00:00","14:23:00","14:45:00","15:08:00","15:30:00",null,null,null,null,null,40]
["H40 Mel","12:30:00","12:52:00","13:14:00","13:36:00","13:58:00","14:20:00","14:42:00","15:04:00","15:26:00",null,null,null,null,null,41]
["H40 Høj","12:30:00","12:51:00","13:13:00","13:34:00","13:56:00","14:17:00","14:39:00","15:00:00","15:21:00",null,null,null,null,null,42]
["H50 Lav","12:32:00","12:56:00","13:21:00","13:45:00","14:09:00","14:34:00","14:58:00","15:22:00","15:47:00",null,null,null,null,null,37]
["H50 Mel","12:32:00","12:56:00","13:19:00","13:43:00","14:07:00","14:30:00","14:54:00","15:18:00","15:41:00",null,null,null,null,null,38]
["H50 Høj","12:32:00","12:55:00","13:18:00","13:41:00","14:04:00","14:27:00","14:50:00","15:14:00","15:37:00",null,null,null,null,null,39]
["H60 Lav","12:34:00","12:59:00","13:24:00","13:49:00","14:14:00","14:39:00","15:04:00","15:29:00",null,null,null,null,null,null,36]
["H60 Mel","12:34:00","12:58:00","13:23:00","13:47:00","14:11:00","14:36:00","15:00:00","15:24:00",null,null,null,null,null,null,37]
["H60 Høj","12:34:00","12:58:00","13:21:00","13:45:00","14:09:00","14:32:00","14:56:00","15:20:00",null,null,null,null,null,null,38]
["H70 Lav","12:36:00","13:02:00","13:27:00","13:53:00","14:19:00","14:45:00","15:10:00","15:36:00",null,null,null,null,null,null,35]
["H70 Mel","12:36:00","13:01:00","13:26:00","13:51:00","14:16:00","14:41:00","15:06:00","15:31:00",null,null,null,null,null,null,36]
["H70 Høj","12:36:00","13:00:00","13:25:00","13:49:00","14:13:00","14:38:00","15:02:00","15:26:00",null,null,null,null,null,null,37]
["A Lav","15:15:00","15:35:00","15:56:00","16:16:00","16:37:00","16:57:00","17:18:00","17:38:00","17:59:00","18:19:00","18:40:00","19:00:00","19:20:00",null,44]
["A Mel","15:15:00","15:35:00","15:55:00","16:15:00","16:35:00","16:55:00","17:15:00","17:35:00","17:55:00","18:15:00","18:35:00","18:55:00","19:15:00",null,45]
["A Høj","15:15:00","15:35:00","15:54:00","16:14:00","16:33:00","16:53:00","17:12:00","17:32:00","17:52:00","18:11:00","18:31:00","18:50:00","19:10:00",null,46]
["B Lav","15:17:00","15:38:00","16:00:00","16:21:00","16:43:00","17:04:00","17:26:00","17:47:00","18:08:00",null,null,null,null,null,42]
["B Mel","15:17:00","15:38:00","15:59:00","16:20:00","16:41:00","17:02:00","17:23:00","17:44:00","18:04:00",null,null,null,null,null,43]
["B Høj","15:17:00","15:37:00","15:58:00","16:18:00","16:39:00","16:59:00","17:20:00","17:40:00","18:01:00",null,null,null,null,null,44]
[null,""]
[null,""]
[null,""]
[null,""]
[null,""]
[null,""]
[null,""]
[null,""]
[null,""]
[null,""]
[null,""]
[null,""]
[null,""]
[null,""]
[null,""]
[null,""]
[null,""]
[null,""]
[null,""]
[null,""]
[null,""]
[null,""]
[null,""]
[null,""]
[null,""]
[null,""]
[null,""]

{"sheet":"Tidsskema","index":3,"n_rows":111,"n_cols":8,"rows_kept":111,"cut":false,"hidden":false,"merged":[]}
["Klasse","Forventet kl.",null,"Resterende omgange","Faktisk tid","Førerbil/slutbil",null," "]
["U15 + U16P","08:00:00","Start",3]
["U13","08:02:00","Start",2]
["U11","08:05:00","Start",1]
["U15 + U16P","08:26:00","2. omgang",2]
["U13","08:31:00","2. omgang",1]
["U11","08:36:00","Mål",""]
["U15 + U16P","08:53:00","3. omgang",1]
["U13","09:00:00","Mål",""]
["U17 + DJUN","09:15:00","Start",5]
["DB","09:15:00","Start",5]
["U15 + U16P","09:19:00","Mål",""]
["U19","09:30:00","Start",6]
["C","09:33:00","Start",8]
["DA","09:33:00","Start",9]
["D","09:35:00","Start",6]
["U17 + DJUN","09:38:00","2. omgang",4]
["DB","09:39:00","2. omgang",4]
["U19","09:51:00","2. omgang",5]
["C","09:54:00","2. omgang",7]
["DA","09:54:00","2. omgang",8]
["D","09:57:00","2. omgang",5]
["U17 + DJUN","10:01:00","3. omgang",3]
["DB","10:04:00","3. omgang",3]
["U19","10:12:00","3. omgang",4]
["C","10:16:00","3. omgang",6]
["DA","10:16:00","3. omgang",7]
["D","10:19:00","3. omgang",4]
["U17 + DJUN","10:24:00","4. omgang",2]
["DB","10:28:00","4. omgang",2]
["U19","10:33:00","4. omgang",3]
["C","10:37:00","4. omgang",5]
["DA","10:37:00","4. omgang",6]
["D","10:41:00","4. omgang",3]
["U17 + DJUN","10:47:00","5. omgang",1]
["DB","10:52:00","5. omgang",1]
["U19","10:54:00","5. omgang",2]
["C","10:59:00","5. omgang",4]
["DA","10:59:00","5. omgang",5]
["D","11:03:00","5. omgang",2]
["U17 + DJUN","11:10:00","Mål",""]
["U19","11:15:00","6. omgang",1]
["DB","11:17:00","Mål",""]
["C","11:20:00","6. omgang",3]
["DA","11:20:00","6. omgang",4]
["D","11:25:00","6. omgang",1]
["U19","11:36:00","Mål",""]
["C","11:42:00","7. omgang",2]
["DA","11:42:00","7. omgang",3]
["D","11:47:00","Mål",""]
["C","12:03:00","8. omgang",1]
["DA","12:03:00","8. omgang",2]
["C","12:24:00","Mål",""]
["DA","12:24:00","9. omgang",1]
["H40","12:30:00","Start",8]
["H50","12:32:00","Start",8]
["H60","12:34:00","Start",7]
["H70","12:36:00","Start",7]
["DA","12:46:00","Mål",""]
["H40","12:52:00","2. omgang",7]
["H50","12:56:00","2. omgang",7]
["H60","12:58:00","2. omgang",6]
["H70","13:01:00","2. omgang",6]
["H40","13:14:00","3. omgang",6]
["H50","13:19:00","3. omgang",6]
["H60","13:23:00","3. omgang",5]
["H70","13:26:00","3. omgang",5]
["H40","13:36:00","4. omgang",5]
["H50","13:43:00","4. omgang",5]
["H60","13:47:00","4. omgang",4]
["H70","13:51:00","4. omgang",4]
["H40","13:58:00","5. omgang",4]
["H50","14:07:00","5. omgang",4]
["H60","14:11:00","5. omgang",3]
["H70","14:16:00","5. omgang",3]
["H40","14:20:00","6. omgang",3]
["H50","14:30:00","6. omgang",3]
["H60","14:36:00","6. omgang",2]
["H70","14:41:00","6. omgang",2]
["H40","14:42:00","7. omgang",2]
["H50","14:54:00","7. omgang",2]
["H60","15:00:00","7. omgang",1]
["H40","15:04:00","8. omgang",1]
["H70","15:06:00","7. omgang",1]
["A","15:15:00","Start",12]
["B","15:17:00","Start",8]
["H50","15:18:00","8. omgang",1]
["H60","15:24:00","Mål",""]
["H40","15:26:00","Mål",""]
["H70","15:31:00","Mål",""]
["A","15:35:00","2. omgang",11]
["B","15:38:00","2. omgang",7]
["H50","15:41:00","Mål",""]
["A","15:55:00","3. omgang",10]
["B","15:59:00","3. omgang",6]
["A","16:15:00","4. omgang",9]
["B","16:20:00","4. omgang",5]
["A","16:35:00","5. omgang",8]
["B","16:41:00","5. omgang",4]
["A","16:55:00","6. omgang",7]
["B","17:02:00","6. omgang",3]
["A","17:15:00","7. omgang",6]
["B","17:23:00","7. omgang",2]
["A","17:35:00","8. omgang",5]
["B","17:44:00","8. omgang",1]
["A","17:55:00","9. omgang",4]
["B","18:04:00","Mål",""]
["A","18:15:00","10. omgang",3]
["A","18:35:00","11. omgang",2]
["A","18:55:00","12. omgang",1]
["A","19:15:00","Mål",""]

{"sheet":"Kopiark","index":4,"n_rows":49,"n_cols":16,"rows_kept":49,"cut":false,"hidden":true,"merged":[]}
["Klasse","Start","1. omgang","2. omgang","3. omgang","4. omgang","5. omgang","6. omgang","7. omgang","8. omgang","9. omgang","10. omgang","11. omgang","12. omgang",6.9444445000000005E-4,"Gnms.fart"]
[]
[]
[]
[{"$f":"Indtast!$A8&\" \"&Indtast!$E$2","v":"U15 + U16P Lav"},{"$f":"IF(Indtast!$B$8<>\"\",Indtast!$B$8,\"\")","v":"08:00:00"},{"$f":"IF(Indtast!I8<>\"\",ROUND((60/$P5*Indtast!I$8),0)*$O$1+$B5,IF(Indtast!I9<>\"\",ROUND((60/$P5*Indtast!I$9),0)*$O$1+$B5,\"x\"))","v":"08:27:00"},{"$f":"IF(Indtast!J8<>\"\",ROUND((60/$P5*Indtast!J$8),0)*$O$1+$B5,IF(Indtast!J9<>\"\",ROUND((60/$P5*Indtast!J$9),0)*$O$1+$B5,\"x\"))","v":"08:55:00"},{"$f":"IF(Indtast!K8<>\"\",ROUND((60/$P5*Indtast!K$8),0)*$O$1+$B5,IF(Indtast!K9<>\"\",ROUND((60/$P5*Indtast!K$9),0)*$O$1+$B5,\"x\"))","v":"09:22:00"},{"$f":"IF(Indtast!L8<>\"\",ROUND((60/$P5*Indtast!L$8),0)*$O$1+$B5,IF(Indtast!L9<>\"\",ROUND((60/$P5*Indtast!L$9),0)*$O$1+$B5,\"x\"))","v":"x"},{"$f":"IF(Indtast!M8<>\"\",ROUND((60/$P5*Indtast!M$8),0)*$O$1+$B5,IF(Indtast!M9<>\"\",ROUND((60/$P5*Indtast!M$9),0)*$O$1+$B5,\"x\"))","v":"x"},{"$f":"IF(Indtast!N8<>\"\",ROUND((60/$P5*Indtast!N$8),0)*$O$1+$B5,IF(Indtast!N9<>\"\",ROUND((60/$P5*Indtast!N$9),0)*$O$1+$B5,\"x\"))","v":"x"},{"$f":"IF(Indtast!O8<>\"\",ROUND((60/$P5*Indtast!O$8),0)*$O$1+$B5,IF(Indtast!O9<>\"\",ROUND((60/$P5*Indtast!O$9),0)*$O$1+$B5,\"x\"))","v":"x"},{"$f":"IF(Indtast!P8<>\"\",ROUND((60/$P5*Indtast!P$8),0)*$O$1+$B5,IF(Indtast!P9<>\"\",ROUND((60/$P5*Indtast!P$9),0)*$O$1+$B5,\"x\"))","v":"x"},{"$f":"IF(Indtast!Q8<>\"\",ROUND((60/$P5*Indtast!Q$8),0)*$O$1+$B5,IF(Indtast!Q9<>\"\",ROUND((60/$P5*Indtast!Q$9),0)*$O$1+$B5,\"x\"))","v":"x"},{"$f":"IF(Indtast!R8<>\"\",ROUND((60/$P5*Indtast!R$8),0)*$O$1+$B5,IF(Indtast!R9<>\"\",ROUND((60/$P5*Indtast!R$9),0)*$O$1+$B5,\"x\"))","v":"x"},{"$f":"IF(Indtast!S8<>\"\",ROUND((60/$P5*Indtast!S$8),0)*$O$1+$B5,IF(Indtast!S9<>\"\",ROUND((60/$P5*Indtast!S$9),0)*$O$1+$B5,\"x\"))","v":"x"},{"$f":"IF(Indtast!T8<>\"\",ROUND((60/$P5*Indtast!T$8),0)*$O$1+$B5,IF(Indtast!T9<>\"\",ROUND((60/$P5*Indtast!T$9),0)*$O$1+$B5,\"x\"))","v":"x"},null,{"$f":"Indtast!$E$8","v":33}]
[{"$f":"Indtast!A8&\" \"&Indtast!$D$2","v":"U15 + U16P Mel"},{"$f":"IF(Indtast!$B$8<>\"\",Indtast!$B$8,\"\")","v":"08:00:00"},{"$f":"IF(Indtast!I8<>\"\",ROUND((60/$P6*Indtast!I$8),0)*$O$1+$B6,IF(Indtast!I9<>\"\",ROUND((60/$P6*Indtast!I$9),0)*$O$1+$B6,\"x\"))","v":"08:26:00"},{"$f":"IF(Indtast!J8<>\"\",ROUND((60/$P6*Indtast!J$8),0)*$O$1+$B6,IF(Indtast!J9<>\"\",ROUND((60/$P6*Indtast!J$9),0)*$O$1+$B6,\"x\"))","v":"08:53:00"},{"$f":"IF(Indtast!K8<>\"\",ROUND((60/$P6*Indtast!K$8),0)*$O$1+$B6,IF(Indtast!K9<>\"\",ROUND((60/$P6*Indtast!K$9),0)*$O$1+$B6,\"x\"))","v":"09:19:00"},{"$f":"IF(Indtast!L8<>\"\",ROUND((60/$P6*Indtast!L$8),0)*$O$1+$B6,IF(Indtast!L9<>\"\",ROUND((60/$P6*Indtast!L$9),0)*$O$1+$B6,\"x\"))","v":"x"},{"$f":"IF(Indtast!M8<>\"\",ROUND((60/$P6*Indtast!M$8),0)*$O$1+$B6,IF(Indtast!M9<>\"\",ROUND((60/$P6*Indtast!M$9),0)*$O$1+$B6,\"x\"))","v":"x"},{"$f":"IF(Indtast!N8<>\"\",ROUND((60/$P6*Indtast!N$8),0)*$O$1+$B6,IF(Indtast!N9<>\"\",ROUND((60/$P6*Indtast!N$9),0)*$O$1+$B6,\"x\"))","v":"x"},{"$f":"IF(Indtast!O8<>\"\",ROUND((60/$P6*Indtast!O$8),0)*$O$1+$B6,IF(Indtast!O9<>\"\",ROUND((60/$P6*Indtast!O$9),0)*$O$1+$B6,\"x\"))","v":"x"},{"$f":"IF(Indtast!P8<>\"\",ROUND((60/$P6*Indtast!P$8),0)*$O$1+$B6,IF(Indtast!P9<>\"\",ROUND((60/$P6*Indtast!P$9),0)*$O$1+$B6,\"x\"))","v":"x"},{"$f":"IF(Indtast!Q8<>\"\",ROUND((60/$P6*Indtast!Q$8),0)*$O$1+$B6,IF(Indtast!Q9<>\"\",ROUND((60/$P6*Indtast!Q$9),0)*$O$1+$B6,\"x\"))","v":"x"},{"$f":"IF(Indtast!R8<>\"\",ROUND((60/$P6*Indtast!R$8),0)*$O$1+$B6,IF(Indtast!R9<>\"\",ROUND((60/$P6*Indtast!R$9),0)*$O$1+$B6,\"x\"))","v":"x"},{"$f":"IF(Indtast!S8<>\"\",ROUND((60/$P6*Indtast!S$8),0)*$O$1+$B6,IF(Indtast!S9<>\"\",ROUND((60/$P6*Indtast!S$9),0)*$O$1+$B6,\"x\"))","v":"x"},{"$f":"IF(Indtast!T8<>\"\",ROUND((60/$P6*Indtast!T$8),0)*$O$1+$B6,IF(Indtast!T9<>\"\",ROUND((60/$P6*Indtast!T$9),0)*$O$1+$B6,\"x\"))","v":"x"},null,{"$f":"Indtast!$D$8","v":34}]
[{"$f":"Indtast!A8&\" \"&Indtast!$C$2","v":"U15 + U16P Høj"},{"$f":"IF(Indtast!$B$8<>\"\",Indtast!$B$8,\"\")","v":"08:00:00"},{"$f":"IF(Indtast!I8<>\"\",ROUND((60/$P7*Indtast!I$8),0)*$O$1+$B7,IF(Indtast!I9<>\"\",ROUND((60/$P7*Indtast!I$9),0)*$O$1+$B7,\"x\"))","v":"08:26:00"},{"$f":"IF(Indtast!J8<>\"\",ROUND((60/$P7*Indtast!J$8),0)*$O$1+$B7,IF(Indtast!J9<>\"\",ROUND((60/$P7*Indtast!J$9),0)*$O$1+$B7,\"x\"))","v":"08:51:00"},{"$f":"IF(Indtast!K8<>\"\",ROUND((60/$P7*Indtast!K$8),0)*$O$1+$B7,IF(Indtast!K9<>\"\",ROUND((60/$P7*Indtast!K$9),0)*$O$1+$B7,\"x\"))","v":"09:17:00"},{"$f":"IF(Indtast!L8<>\"\",ROUND((60/$P7*Indtast!L$8),0)*$O$1+$B7,IF(Indtast!L9<>\"\",ROUND((60/$P7*Indtast!L$9),0)*$O$1+$B7,\"x\"))","v":"x"},{"$f":"IF(Indtast!M8<>\"\",ROUND((60/$P7*Indtast!M$8),0)*$O$1+$B7,IF(Indtast!M9<>\"\",ROUND((60/$P7*Indtast!M$9),0)*$O$1+$B7,\"x\"))","v":"x"},{"$f":"IF(Indtast!N8<>\"\",ROUND((60/$P7*Indtast!N$8),0)*$O$1+$B7,IF(Indtast!N9<>\"\",ROUND((60/$P7*Indtast!N$9),0)*$O$1+$B7,\"x\"))","v":"x"},{"$f":"IF(Indtast!O8<>\"\",ROUND((60/$P7*Indtast!O$8),0)*$O$1+$B7,IF(Indtast!O9<>\"\",ROUND((60/$P7*Indtast!O$9),0)*$O$1+$B7,\"x\"))","v":"x"},{"$f":"IF(Indtast!P8<>\"\",ROUND((60/$P7*Indtast!P$8),0)*$O$1+$B7,IF(Indtast!P9<>\"\",ROUND((60/$P7*Indtast!P$9),0)*$O$1+$B7,\"x\"))","v":"x"},{"$f":"IF(Indtast!Q8<>\"\",ROUND((60/$P7*Indtast!Q$8),0)*$O$1+$B7,IF(Indtast!Q9<>\"\",ROUND((60/$P7*Indtast!Q$9),0)*$O$1+$B7,\"x\"))","v":"x"},{"$f":"IF(Indtast!R8<>\"\",ROUND((60/$P7*Indtast!R$8),0)*$O$1+$B7,IF(Indtast!R9<>\"\",ROUND((60/$P7*Indtast!R$9),0)*$O$1+$B7,\"x\"))","v":"x"},{"$f":"IF(Indtast!S8<>\"\",ROUND((60/$P7*Indtast!S$8),0)*$O$1+$B7,IF(Indtast!S9<>\"\",ROUND((60/$P7*Indtast!S$9),0)*$O$1+$B7,\"x\"))","v":"x"},{"$f":"IF(Indtast!T8<>\"\",ROUND((60/$P7*Indtast!T$8),0)*$O$1+$B7,IF(Indtast!T9<>\"\",ROUND((60/$P7*Indtast!T$9),0)*$O$1+$B7,\"x\"))","v":"x"},null,{"$f":"Indtast!$C$8","v":35}]
[{"$f":"IF(Indtast!$A$6<>\"\",Indtast!$A$6&\" \"&Indtast!$E$2,\"\")","v":"U13 Lav"},{"$f":"IF(Indtast!$B$6<>\"\",Indtast!$B$6,\"\")","v":"08:02:00"},{"$f":"IF(Indtast!I6<>\"\",ROUND((60/$P8*Indtast!I$6),0)*$O$1+$B8,IF(Indtast!I7<>\"\",ROUND((60/$P8*Indtast!I$7),0)*$O$1+$B8,\"x\"))","v":"08:32:00"},{"$f":"IF(Indtast!J6<>\"\",ROUND((60/$P8*Indtast!J$6),0)*$O$1+$B8,IF(Indtast!J7<>\"\",ROUND((60/$P8*Indtast!J$7),0)*$O$1+$B8,\"x\"))","v":"09:02:00"},{"$f":"IF(Indtast!K6<>\"\",ROUND((60/$P8*Indtast!K$6),0)*$O$1+$B8,IF(Indtast!K7<>\"\",ROUND((60/$P8*Indtast!K$7),0)*$O$1+$B8,\"x\"))","v":"x"},{"$f":"IF(Indtast!L6<>\"\",ROUND((60/$P8*Indtast!L$6),0)*$O$1+$B8,IF(Indtast!L7<>\"\",ROUND((60/$P8*Indtast!L$7),0)*$O$1+$B8,\"x\"))","v":"x"},{"$f":"IF(Indtast!M6<>\"\",ROUND((60/$P8*Indtast!M$6),0)*$O$1+$B8,IF(Indtast!M7<>\"\",ROUND((60/$P8*Indtast!M$7),0)*$O$1+$B8,\"x\"))","v":"x"},{"$f":"IF(Indtast!N6<>\"\",ROUND((60/$P8*Indtast!N$6),0)*$O$1+$B8,IF(Indtast!N7<>\"\",ROUND((60/$P8*Indtast!N$7),0)*$O$1+$B8,\"x\"))","v":"x"},{"$f":"IF(Indtast!O6<>\"\",ROUND((60/$P8*Indtast!O$6),0)*$O$1+$B8,IF(Indtast!O7<>\"\",ROUND((60/$P8*Indtast!O$7),0)*$O$1+$B8,\"x\"))","v":"x"},{"$f":"IF(Indtast!P6<>\"\",ROUND((60/$P8*Indtast!P$6),0)*$O$1+$B8,IF(Indtast!P7<>\"\",ROUND((60/$P8*Indtast!P$7),0)*$O$1+$B8,\"x\"))","v":"x"},{"$f":"IF(Indtast!Q6<>\"\",ROUND((60/$P8*Indtast!Q$6),0)*$O$1+$B8,IF(Indtast!Q7<>\"\",ROUND((60/$P8*Indtast!Q$7),0)*$O$1+$B8,\"x\"))","v":"x"},{"$f":"IF(Indtast!R6<>\"\",ROUND((60/$P8*Indtast!R$6),0)*$O$1+$B8,IF(Indtast!R7<>\"\",ROUND((60/$P8*Indtast!R$7),0)*$O$1+$B8,\"x\"))","v":"x"},{"$f":"IF(Indtast!S6<>\"\",ROUND((60/$P8*Indtast!S$6),0)*$O$1+$B8,IF(Indtast!S7<>\"\",ROUND((60/$P8*Indtast!S$7),0)*$O$1+$B8,\"x\"))","v":"x"},{"$f":"IF(Indtast!T6<>\"\",ROUND((60/$P8*Indtast!T$6),0)*$O$1+$B8,IF(Indtast!T7<>\"\",ROUND((60/$P8*Indtast!T$7),0)*$O$1+$B8,\"x\"))","v":"x"},null,{"$f":"Indtast!$E6","v":30}]
[{"$f":"Indtast!A6&\" \"&Indtast!$D$2","v":"U13 Mel"},{"$f":"IF(Indtast!$B$6<>\"\",Indtast!$B$6,\"\")","v":"08:02:00"},{"$f":"IF(Indtast!I6<>\"\",ROUND((60/$P9*Indtast!I$6),0)*$O$1+$B9,IF(Indtast!I7<>\"\",ROUND((60/$P9*Indtast!I$7),0)*$O$1+$B9,\"x\"))","v":"08:31:00"},{"$f":"IF(Indtast!J6<>\"\",ROUND((60/$P9*Indtast!J$6),0)*$O$1+$B9,IF(Indtast!J7<>\"\",ROUND((60/$P9*Indtast!J$7),0)*$O$1+$B9,\"x\"))","v":"09:00:00"},{"$f":"IF(Indtast!K6<>\"\",ROUND((60/$P9*Indtast!K$6),0)*$O$1+$B9,IF(Indtast!K7<>\"\",ROUND((60/$P9*Indtast!K$7),0)*$O$1+$B9,\"x\"))","v":"x"},{"$f":"IF(Indtast!L6<>\"\",ROUND((60/$P9*Indtast!L$6),0)*$O$1+$B9,IF(Indtast!L7<>\"\",ROUND((60/$P9*Indtast!L$7),0)*$O$1+$B9,\"x\"))","v":"x"},{"$f":"IF(Indtast!M6<>\"\",ROUND((60/$P9*Indtast!M$6),0)*$O$1+$B9,IF(Indtast!M7<>\"\",ROUND((60/$P9*Indtast!M$7),0)*$O$1+$B9,\"x\"))","v":"x"},{"$f":"IF(Indtast!N6<>\"\",ROUND((60/$P9*Indtast!N$6),0)*$O$1+$B9,IF(Indtast!N7<>\"\",ROUND((60/$P9*Indtast!N$7),0)*$O$1+$B9,\"x\"))","v":"x"},{"$f":"IF(Indtast!O6<>\"\",ROUND((60/$P9*Indtast!O$6),0)*$O$1+$B9,IF(Indtast!O7<>\"\",ROUND((60/$P9*Indtast!O$7),0)*$O$1+$B9,\"x\"))","v":"x"},{"$f":"IF(Indtast!P6<>\"\",ROUND((60/$P9*Indtast!P$6),0)*$O$1+$B9,IF(Indtast!P7<>\"\",ROUND((60/$P9*Indtast!P$7),0)*$O$1+$B9,\"x\"))","v":"x"},{"$f":"IF(Indtast!Q6<>\"\",ROUND((60/$P9*Indtast!Q$6),0)*$O$1+$B9,IF(Indtast!Q7<>\"\",ROUND((60/$P9*Indtast!Q$7),0)*$O$1+$B9,\"x\"))","v":"x"},{"$f":"IF(Indtast!R6<>\"\",ROUND((60/$P9*Indtast!R$6),0)*$O$1+$B9,IF(Indtast!R7<>\"\",ROUND((60/$P9*Indtast!R$7),0)*$O$1+$B9,\"x\"))","v":"x"},{"$f":"IF(Indtast!S6<>\"\",ROUND((60/$P9*Indtast!S$6),0)*$O$1+$B9,IF(Indtast!S7<>\"\",ROUND((60/$P9*Indtast!S$7),0)*$O$1+$B9,\"x\"))","v":"x"},{"$f":"IF(Indtast!T6<>\"\",ROUND((60/$P9*Indtast!T$6),0)*$O$1+$B9,IF(Indtast!T7<>\"\",ROUND((60/$P9*Indtast!T$7),0)*$O$1+$B9,\"x\"))","v":"x"},null,{"$f":"Indtast!$D6","v":31}]
[{"$f":"Indtast!A6&\" \"&Indtast!$C$2","v":"U13 Høj"},{"$f":"IF(Indtast!$B$6<>\"\",Indtast!$B$6,\"\")","v":"08:02:00"},{"$f":"IF(Indtast!I6<>\"\",ROUND((60/$P10*Indtast!I$6),0)*$O$1+$B10,IF(Indtast!I7<>\"\",ROUND((60/$P10*Indtast!I$7),0)*$O$1+$B10,\"x\"))","v":"08:30:00"},{"$f":"IF(Indtast!J6<>\"\",ROUND((60/$P10*Indtast!J$6),0)*$O$1+$B10,IF(Indtast!J7<>\"\",ROUND((60/$P10*Indtast!J$7),0)*$O$1+$B10,\"x\"))","v":"08:58:00"},{"$f":"IF(Indtast!K6<>\"\",ROUND((60/$P10*Indtast!K$6),0)*$O$1+$B10,IF(Indtast!K7<>\"\",ROUND((60/$P10*Indtast!K$7),0)*$O$1+$B10,\"x\"))","v":"x"},{"$f":"IF(Indtast!L6<>\"\",ROUND((60/$P10*Indtast!L$6),0)*$O$1+$B10,IF(Indtast!L7<>\"\",ROUND((60/$P10*Indtast!L$7),0)*$O$1+$B10,\"x\"))","v":"x"},{"$f":"IF(Indtast!M6<>\"\",ROUND((60/$P10*Indtast!M$6),0)*$O$1+$B10,IF(Indtast!M7<>\"\",ROUND((60/$P10*Indtast!M$7),0)*$O$1+$B10,\"x\"))","v":"x"},{"$f":"IF(Indtast!N6<>\"\",ROUND((60/$P10*Indtast!N$6),0)*$O$1+$B10,IF(Indtast!N7<>\"\",ROUND((60/$P10*Indtast!N$7),0)*$O$1+$B10,\"x\"))","v":"x"},{"$f":"IF(Indtast!O6<>\"\",ROUND((60/$P10*Indtast!O$6),0)*$O$1+$B10,IF(Indtast!O7<>\"\",ROUND((60/$P10*Indtast!O$7),0)*$O$1+$B10,\"x\"))","v":"x"},{"$f":"IF(Indtast!P6<>\"\",ROUND((60/$P10*Indtast!P$6),0)*$O$1+$B10,IF(Indtast!P7<>\"\",ROUND((60/$P10*Indtast!P$7),0)*$O$1+$B10,\"x\"))","v":"x"},{"$f":"IF(Indtast!Q6<>\"\",ROUND((60/$P10*Indtast!Q$6),0)*$O$1+$B10,IF(Indtast!Q7<>\"\",ROUND((60/$P10*Indtast!Q$7),0)*$O$1+$B10,\"x\"))","v":"x"},{"$f":"IF(Indtast!R6<>\"\",ROUND((60/$P10*Indtast!R$6),0)*$O$1+$B10,IF(Indtast!R7<>\"\",ROUND((60/$P10*Indtast!R$7),0)*$O$1+$B10,\"x\"))","v":"x"},{"$f":"IF(Indtast!S6<>\"\",ROUND((60/$P10*Indtast!S$6),0)*$O$1+$B10,IF(Indtast!S7<>\"\",ROUND((60/$P10*Indtast!S$7),0)*$O$1+$B10,\"x\"))","v":"x"},{"$f":"IF(Indtast!T6<>\"\",ROUND((60/$P10*Indtast!T$6),0)*$O$1+$B10,IF(Indtast!T7<>\"\",ROUND((60/$P10*Indtast!T$7),0)*$O$1+$B10,\"x\"))","v":"x"},null,{"$f":"Indtast!$C6","v":32}]
[{"$f":"IF(Indtast!$A$4<>\"\",Indtast!$A$4&\" \"&Indtast!$E$2,\"\")","v":"U11 Lav"},{"$f":"IF(Indtast!$B$4<>\"\",Indtast!$B$4,\"\")","v":"08:05:00"},{"$f":"IF(Indtast!I4<>\"\",ROUND((60/$P11*Indtast!I$4),0)*$O$1+$B11,IF(Indtast!I5<>\"\",ROUND((60/$P11*Indtast!I$5),0)*$O$1+$B11,\"x\"))","v":"08:37:00"},{"$f":"IF(Indtast!J4<>\"\",ROUND((60/$P11*Indtast!J$4),0)*$O$1+$B11,IF(Indtast!J5<>\"\",ROUND((60/$P11*Indtast!J$5),0)*$O$1+$B11,\"x\"))","v":"x"},{"$f":"IF(Indtast!K4<>\"\",ROUND((60/$P11*Indtast!K$4),0)*$O$1+$B11,IF(Indtast!K5<>\"\",ROUND((60/$P11*Indtast!K$5),0)*$O$1+$B11,\"x\"))","v":"x"},{"$f":"IF(Indtast!L4<>\"\",ROUND((60/$P11*Indtast!L$4),0)*$O$1+$B11,IF(Indtast!L5<>\"\",ROUND((60/$P11*Indtast!L$5),0)*$O$1+$B11,\"x\"))","v":"x"},{"$f":"IF(Indtast!M4<>\"\",ROUND((60/$P11*Indtast!M$4),0)*$O$1+$B11,IF(Indtast!M5<>\"\",ROUND((60/$P11*Indtast!M$5),0)*$O$1+$B11,\"x\"))","v":"x"},{"$f":"IF(Indtast!N4<>\"\",ROUND((60/$P11*Indtast!N$4),0)*$O$1+$B11,IF(Indtast!N5<>\"\",ROUND((60/$P11*Indtast!N$5),0)*$O$1+$B11,\"x\"))","v":"x"},{"$f":"IF(Indtast!O4<>\"\",ROUND((60/$P11*Indtast!O$4),0)*$O$1+$B11,IF(Indtast!O5<>\"\",ROUND((60/$P11*Indtast!O$5),0)*$O$1+$B11,\"x\"))","v":"x"},{"$f":"IF(Indtast!P4<>\"\",ROUND((60/$P11*Indtast!P$4),0)*$O$1+$B11,IF(Indtast!P5<>\"\",ROUND((60/$P11*Indtast!P$5),0)*$O$1+$B11,\"x\"))","v":"x"},{"$f":"IF(Indtast!Q4<>\"\",ROUND((60/$P11*Indtast!Q$4),0)*$O$1+$B11,IF(Indtast!Q5<>\"\",ROUND((60/$P11*Indtast!Q$5),0)*$O$1+$B11,\"x\"))","v":"x"},{"$f":"IF(Indtast!R4<>\"\",ROUND((60/$P11*Indtast!R$4),0)*$O$1+$B11,IF(Indtast!R5<>\"\",ROUND((60/$P11*Indtast!R$5),0)*$O$1+$B11,\"x\"))","v":"x"},{"$f":"IF(Indtast!S4<>\"\",ROUND((60/$P11*Indtast!S$4),0)*$O$1+$B11,IF(Indtast!S5<>\"\",ROUND((60/$P11*Indtast!S$5),0)*$O$1+$B11,\"x\"))","v":"x"},{"$f":"IF(Indtast!T4<>\"\",ROUND((60/$P11*Indtast!T$4),0)*$O$1+$B11,IF(Indtast!T5<>\"\",ROUND((60/$P11*Indtast!T$5),0)*$O$1+$B11,\"x\"))","v":"x"},null,{"$f":"Indtast!$E$4","v":28}]
[{"$f":"IF(Indtast!$A$4<>\"\",Indtast!$A$4&\" \"&Indtast!$D$2,\"\")","v":"U11 Mel"},{"$f":"IF(Indtast!$B$4<>\"\",Indtast!$B$4,\"\")","v":"08:05:00"},{"$f":"IF(Indtast!I4<>\"\",ROUND((60/$P12*Indtast!I$4),0)*$O$1+$B12,IF(Indtast!I5<>\"\",ROUND((60/$P12*Indtast!I$5),0)*$O$1+$B12,\"x\"))","v":"08:36:00"},{"$f":"IF(Indtast!J4<>\"\",ROUND((60/$P12*Indtast!J$4),0)*$O$1+$B12,IF(Indtast!J5<>\"\",ROUND((60/$P12*Indtast!J$5),0)*$O$1+$B12,\"x\"))","v":"x"},{"$f":"IF(Indtast!K4<>\"\",ROUND((60/$P12*Indtast!K$4),0)*$O$1+$B12,IF(Indtast!K5<>\"\",ROUND((60/$P12*Indtast!K$5),0)*$O$1+$B12,\"x\"))","v":"x"},{"$f":"IF(Indtast!L4<>\"\",ROUND((60/$P12*Indtast!L$4),0)*$O$1+$B12,IF(Indtast!L5<>\"\",ROUND((60/$P12*Indtast!L$5),0)*$O$1+$B12,\"x\"))","v":"x"},{"$f":"IF(Indtast!M4<>\"\",ROUND((60/$P12*Indtast!M$4),0)*$O$1+$B12,IF(Indtast!M5<>\"\",ROUND((60/$P12*Indtast!M$5),0)*$O$1+$B12,\"x\"))","v":"x"},{"$f":"IF(Indtast!N4<>\"\",ROUND((60/$P12*Indtast!N$4),0)*$O$1+$B12,IF(Indtast!N5<>\"\",ROUND((60/$P12*Indtast!N$5),0)*$O$1+$B12,\"x\"))","v":"x"},{"$f":"IF(Indtast!O4<>\"\",ROUND((60/$P12*Indtast!O$4),0)*$O$1+$B12,IF(Indtast!O5<>\"\",ROUND((60/$P12*Indtast!O$5),0)*$O$1+$B12,\"x\"))","v":"x"},{"$f":"IF(Indtast!P4<>\"\",ROUND((60/$P12*Indtast!P$4),0)*$O$1+$B12,IF(Indtast!P5<>\"\",ROUND((60/$P12*Indtast!P$5),0)*$O$1+$B12,\"x\"))","v":"x"},{"$f":"IF(Indtast!Q4<>\"\",ROUND((60/$P12*Indtast!Q$4),0)*$O$1+$B12,IF(Indtast!Q5<>\"\",ROUND((60/$P12*Indtast!Q$5),0)*$O$1+$B12,\"x\"))","v":"x"},{"$f":"IF(Indtast!R4<>\"\",ROUND((60/$P12*Indtast!R$4),0)*$O$1+$B12,IF(Indtast!R5<>\"\",ROUND((60/$P12*Indtast!R$5),0)*$O$1+$B12,\"x\"))","v":"x"},{"$f":"IF(Indtast!S4<>\"\",ROUND((60/$P12*Indtast!S$4),0)*$O$1+$B12,IF(Indtast!S5<>\"\",ROUND((60/$P12*Indtast!S$5),0)*$O$1+$B12,\"x\"))","v":"x"},{"$f":"IF(Indtast!T4<>\"\",ROUND((60/$P12*Indtast!T$4),0)*$O$1+$B12,IF(Indtast!T5<>\"\",ROUND((60/$P12*Indtast!T$5),0)*$O$1+$B12,\"x\"))","v":"x"},null,{"$f":"Indtast!$D$4","v":29}]
[{"$f":"IF(Indtast!$A$4<>\"\",Indtast!$A$4&\" \"&Indtast!$C$2,\"\")","v":"U11 Høj"},{"$f":"IF(Indtast!$B$4<>\"\",Indtast!$B$4,\"\")","v":"08:05:00"},{"$f":"IF(Indtast!I4<>\"\",ROUND((60/$P13*Indtast!I$4),0)*$O$1+$B13,IF(Indtast!I5<>\"\",ROUND((60/$P13*Indtast!I$5),0)*$O$1+$B13,\"x\"))","v":"08:35:00"},{"$f":"IF(Indtast!J4<>\"\",ROUND((60/$P13*Indtast!J$4),0)*$O$1+$B13,IF(Indtast!J5<>\"\",ROUND((60/$P13*Indtast!J$5),0)*$O$1+$B13,\"x\"))","v":"x"},{"$f":"IF(Indtast!K4<>\"\",ROUND((60/$P13*Indtast!K$4),0)*$O$1+$B13,IF(Indtast!K5<>\"\",ROUND((60/$P13*Indtast!K$5),0)*$O$1+$B13,\"x\"))","v":"x"},{"$f":"IF(Indtast!L4<>\"\",ROUND((60/$P13*Indtast!L$4),0)*$O$1+$B13,IF(Indtast!L5<>\"\",ROUND((60/$P13*Indtast!L$5),0)*$O$1+$B13,\"x\"))","v":"x"},{"$f":"IF(Indtast!M4<>\"\",ROUND((60/$P13*Indtast!M$4),0)*$O$1+$B13,IF(Indtast!M5<>\"\",ROUND((60/$P13*Indtast!M$5),0)*$O$1+$B13,\"x\"))","v":"x"},{"$f":"IF(Indtast!N4<>\"\",ROUND((60/$P13*Indtast!N$4),0)*$O$1+$B13,IF(Indtast!N5<>\"\",ROUND((60/$P13*Indtast!N$5),0)*$O$1+$B13,\"x\"))","v":"x"},{"$f":"IF(Indtast!O4<>\"\",ROUND((60/$P13*Indtast!O$4),0)*$O$1+$B13,IF(Indtast!O5<>\"\",ROUND((60/$P13*Indtast!O$5),0)*$O$1+$B13,\"x\"))","v":"x"},{"$f":"IF(Indtast!P4<>\"\",ROUND((60/$P13*Indtast!P$4),0)*$O$1+$B13,IF(Indtast!P5<>\"\",ROUND((60/$P13*Indtast!P$5),0)*$O$1+$B13,\"x\"))","v":"x"},{"$f":"IF(Indtast!Q4<>\"\",ROUND((60/$P13*Indtast!Q$4),0)*$O$1+$B13,IF(Indtast!Q5<>\"\",ROUND((60/$P13*Indtast!Q$5),0)*$O$1+$B13,\"x\"))","v":"x"},{"$f":"IF(Indtast!R4<>\"\",ROUND((60/$P13*Indtast!R$4),0)*$O$1+$B13,IF(Indtast!R5<>\"\",ROUND((60/$P13*Indtast!R$5),0)*$O$1+$B13,\"x\"))","v":"x"},{"$f":"IF(Indtast!S4<>\"\",ROUND((60/$P13*Indtast!S$4),0)*$O$1+$B13,IF(Indtast!S5<>\"\",ROUND((60/$P13*Indtast!S$5),0)*$O$1+$B13,\"x\"))","v":"x"},{"$f":"IF(Indtast!T4<>\"\",ROUND((60/$P13*Indtast!T$4),0)*$O$1+$B13,IF(Indtast!T5<>\"\",ROUND((60/$P13*Indtast!T$5),0)*$O$1+$B13,\"x\"))","v":"x"},null,{"$f":"Indtast!$C$4","v":30}]
[{"$f":"Indtast!$A10&\" \"&Indtast!$E$2","v":"U17 + DJUN Lav"},{"$f":"IF(Indtast!$B$10<>\"\",Indtast!$B$10,\"\")","v":"09:15:00"},{"$f":"IF(Indtast!I10<>\"\",ROUND((60/$P14*Indtast!I$10),0)*$O$1+$B14,IF(Indtast!I11<>\"\",ROUND((60/$P14*Indtast!I$11),0)*$O$1+$B14,\"x\"))","v":"09:39:00"},{"$f":"IF(Indtast!J10<>\"\",ROUND((60/$P14*Indtast!J$10),0)*$O$1+$B14,IF(Indtast!J11<>\"\",ROUND((60/$P14*Indtast!J$11),0)*$O$1+$B14,\"x\"))","v":"10:02:00"},{"$f":"IF(Indtast!K10<>\"\",ROUND((60/$P14*Indtast!K$10),0)*$O$1+$B14,IF(Indtast!K11<>\"\",ROUND((60/$P14*Indtast!K$11),0)*$O$1+$B14,\"x\"))","v":"10:26:00"},{"$f":"IF(Indtast!L10<>\"\",ROUND((60/$P14*Indtast!L$10),0)*$O$1+$B14,IF(Indtast!L11<>\"\",ROUND((60/$P14*Indtast!L$11),0)*$O$1+$B14,\"x\"))","v":"10:50:00"},{"$f":"IF(Indtast!M10<>\"\",ROUND((60/$P14*Indtast!M$10),0)*$O$1+$B14,IF(Indtast!M11<>\"\",ROUND((60/$P14*Indtast!M$11),0)*$O$1+$B14,\"x\"))","v":"11:13:00"},{"$f":"IF(Indtast!N10<>\"\",ROUND((60/$P14*Indtast!N$10),0)*$O$1+$B14,IF(Indtast!N11<>\"\",ROUND((60/$P14*Indtast!N$11),0)*$O$1+$B14,\"x\"))","v":"x"},{"$f":"IF(Indtast!O10<>\"\",ROUND((60/$P14*Indtast!O$10),0)*$O$1+$B14,IF(Indtast!O11<>\"\",ROUND((60/$P14*Indtast!O$11),0)*$O$1+$B14,\"x\"))","v":"x"},{"$f":"IF(Indtast!P10<>\"\",ROUND((60/$P14*Indtast!P$10),0)*$O$1+$B14,IF(Indtast!P11<>\"\",ROUND((60/$P14*Indtast!P$11),0)*$O$1+$B14,\"x\"))","v":"x"},{"$f":"IF(Indtast!Q10<>\"\",ROUND((60/$P14*Indtast!Q$10),0)*$O$1+$B14,IF(Indtast!Q11<>\"\",ROUND((60/$P14*Indtast!Q$11),0)*$O$1+$B14,\"x\"))","v":"x"},{"$f":"IF(Indtast!R10<>\"\",ROUND((60/$P14*Indtast!R$10),0)*$O$1+$B14,IF(Indtast!R11<>\"\",ROUND((60/$P14*Indtast!R$11),0)*$O$1+$B14,\"x\"))","v":"x"},{"$f":"IF(Indtast!S10<>\"\",ROUND((60/$P14*Indtast!S$10),0)*$O$1+$B14,IF(Indtast!S11<>\"\",ROUND((60/$P14*Indtast!S$11),0)*$O$1+$B14,\"x\"))","v":"x"},{"$f":"IF(Indtast!T10<>\"\",ROUND((60/$P14*Indtast!T$10),0)*$O$1+$B14,IF(Indtast!T11<>\"\",ROUND((60/$P14*Indtast!T$11),0)*$O$1+$B14,\"x\"))","v":"x"},null,{"$f":"Indtast!$E$10","v":38}]
[{"$f":"Indtast!A10&\" \"&Indtast!$D$2","v":"U17 + DJUN Mel"},{"$f":"IF(Indtast!$B$10<>\"\",Indtast!$B$10,\"\")","v":"09:15:00"},{"$f":"IF(Indtast!I10<>\"\",ROUND((60/$P15*Indtast!I$10),0)*$O$1+$B15,IF(Indtast!I11<>\"\",ROUND((60/$P15*Indtast!I$11),0)*$O$1+$B15,\"x\"))","v":"09:38:00"},{"$f":"IF(Indtast!J10<>\"\",ROUND((60/$P15*Indtast!J$10),0)*$O$1+$B15,IF(Indtast!J11<>\"\",ROUND((60/$P15*Indtast!J$11),0)*$O$1+$B15,\"x\"))","v":"10:01:00"},{"$f":"IF(Indtast!K10<>\"\",ROUND((60/$P15*Indtast!K$10),0)*$O$1+$B15,IF(Indtast!K11<>\"\",ROUND((60/$P15*Indtast!K$11),0)*$O$1+$B15,\"x\"))","v":"10:24:00"},{"$f":"IF(Indtast!L10<>\"\",ROUND((60/$P15*Indtast!L$10),0)*$O$1+$B15,IF(Indtast!L11<>\"\",ROUND((60/$P15*Indtast!L$11),0)*$O$1+$B15,\"x\"))","v":"10:47:00"},{"$f":"IF(Indtast!M10<>\"\",ROUND((60/$P15*Indtast!M$10),0)*$O$1+$B15,IF(Indtast!M11<>\"\",ROUND((60/$P15*Indtast!M$11),0)*$O$1+$B15,\"x\"))","v":"11:10:00"},{"$f":"IF(Indtast!N10<>\"\",ROUND((60/$P15*Indtast!N$10),0)*$O$1+$B15,IF(Indtast!N11<>\"\",ROUND((60/$P15*Indtast!N$11),0)*$O$1+$B15,\"x\"))","v":"x"},{"$f":"IF(Indtast!O10<>\"\",ROUND((60/$P15*Indtast!O$10),0)*$O$1+$B15,IF(Indtast!O11<>\"\",ROUND((60/$P15*Indtast!O$11),0)*$O$1+$B15,\"x\"))","v":"x"},{"$f":"IF(Indtast!P10<>\"\",ROUND((60/$P15*Indtast!P$10),0)*$O$1+$B15,IF(Indtast!P11<>\"\",ROUND((60/$P15*Indtast!P$11),0)*$O$1+$B15,\"x\"))","v":"x"},{"$f":"IF(Indtast!Q10<>\"\",ROUND((60/$P15*Indtast!Q$10),0)*$O$1+$B15,IF(Indtast!Q11<>\"\",ROUND((60/$P15*Indtast!Q$11),0)*$O$1+$B15,\"x\"))","v":"x"},{"$f":"IF(Indtast!R10<>\"\",ROUND((60/$P15*Indtast!R$10),0)*$O$1+$B15,IF(Indtast!R11<>\"\",ROUND((60/$P15*Indtast!R$11),0)*$O$1+$B15,\"x\"))","v":"x"},{"$f":"IF(Indtast!S10<>\"\",ROUND((60/$P15*Indtast!S$10),0)*$O$1+$B15,IF(Indtast!S11<>\"\",ROUND((60/$P15*Indtast!S$11),0)*$O$1+$B15,\"x\"))","v":"x"},{"$f":"IF(Indtast!T10<>\"\",ROUND((60/$P15*Indtast!T$10),0)*$O$1+$B15,IF(Indtast!T11<>\"\",ROUND((60/$P15*Indtast!T$11),0)*$O$1+$B15,\"x\"))","v":"x"},null,{"$f":"Indtast!$D$10","v":39}]
[{"$f":"Indtast!A10&\" \"&Indtast!$C$2","v":"U17 + DJUN Høj"},{"$f":"IF(Indtast!$B$10<>\"\",Indtast!$B$10,\"\")","v":"09:15:00"},{"$f":"IF(Indtast!I10<>\"\",ROUND((60/$P16*Indtast!I$10),0)*$O$1+$B16,IF(Indtast!I11<>\"\",ROUND((60/$P16*Indtast!I$11),0)*$O$1+$B16,\"x\"))","v":"09:38:00"},{"$f":"IF(Indtast!J10<>\"\",ROUND((60/$P16*Indtast!J$10),0)*$O$1+$B16,IF(Indtast!J11<>\"\",ROUND((60/$P16*Indtast!J$11),0)*$O$1+$B16,\"x\"))","v":"10:00:00"},{"$f":"IF(Indtast!K10<>\"\",ROUND((60/$P16*Indtast!K$10),0)*$O$1+$B16,IF(Indtast!K11<>\"\",ROUND((60/$P16*Indtast!K$11),0)*$O$1+$B16,\"x\"))","v":"10:23:00"},{"$f":"IF(Indtast!L10<>\"\",ROUND((60/$P16*Indtast!L$10),0)*$O$1+$B16,IF(Indtast!L11<>\"\",ROUND((60/$P16*Indtast!L$11),0)*$O$1+$B16,\"x\"))","v":"10:45:00"},{"$f":"IF(Indtast!M10<>\"\",ROUND((60/$P16*Indtast!M$10),0)*$O$1+$B16,IF(Indtast!M11<>\"\",ROUND((60/$P16*Indtast!M$11),0)*$O$1+$B16,\"x\"))","v":"11:08:00"},{"$f":"IF(Indtast!N10<>\"\",ROUND((60/$P16*Indtast!N$10),0)*$O$1+$B16,IF(Indtast!N11<>\"\",ROUND((60/$P16*Indtast!N$11),0)*$O$1+$B16,\"x\"))","v":"x"},{"$f":"IF(Indtast!O10<>\"\",ROUND((60/$P16*Indtast!O$10),0)*$O$1+$B16,IF(Indtast!O11<>\"\",ROUND((60/$P16*Indtast!O$11),0)*$O$1+$B16,\"x\"))","v":"x"},{"$f":"IF(Indtast!P10<>\"\",ROUND((60/$P16*Indtast!P$10),0)*$O$1+$B16,IF(Indtast!P11<>\"\",ROUND((60/$P16*Indtast!P$11),0)*$O$1+$B16,\"x\"))","v":"x"},{"$f":"IF(Indtast!Q10<>\"\",ROUND((60/$P16*Indtast!Q$10),0)*$O$1+$B16,IF(Indtast!Q11<>\"\",ROUND((60/$P16*Indtast!Q$11),0)*$O$1+$B16,\"x\"))","v":"x"},{"$f":"IF(Indtast!R10<>\"\",ROUND((60/$P16*Indtast!R$10),0)*$O$1+$B16,IF(Indtast!R11<>\"\",ROUND((60/$P16*Indtast!R$11),0)*$O$1+$B16,\"x\"))","v":"x"},{"$f":"IF(Indtast!S10<>\"\",ROUND((60/$P16*Indtast!S$10),0)*$O$1+$B16,IF(Indtast!S11<>\"\",ROUND((60/$P16*Indtast!S$11),0)*$O$1+$B16,\"x\"))","v":"x"},{"$f":"IF(Indtast!T10<>\"\",ROUND((60/$P16*Indtast!T$10),0)*$O$1+$B16,IF(Indtast!T11<>\"\",ROUND((60/$P16*Indtast!T$11),0)*$O$1+$B16,\"x\"))","v":"x"},null,{"$f":"Indtast!$C$10","v":40}]
[{"$f":"Indtast!$A30&\" \"&Indtast!$E$2","v":"DB Lav"},{"$f":"IF(Indtast!$B$30<>\"\",Indtast!$B$30,\"\")","v":"09:15:00"},{"$f":"IF(Indtast!I30<>\"\",ROUND((60/$P17*Indtast!I$30),0)*$O$1+$B17,IF(Indtast!I31<>\"\",ROUND((60/$P17*Indtast!I$31),0)*$O$1+$B17,\"x\"))","v":"09:40:00"},{"$f":"IF(Indtast!J30<>\"\",ROUND((60/$P17*Indtast!J$30),0)*$O$1+$B17,IF(Indtast!J31<>\"\",ROUND((60/$P17*Indtast!J$31),0)*$O$1+$B17,\"x\"))","v":"10:05:00"},{"$f":"IF(Indtast!K30<>\"\",ROUND((60/$P17*Indtast!K$30),0)*$O$1+$B17,IF(Indtast!K31<>\"\",ROUND((60/$P17*Indtast!K$31),0)*$O$1+$B17,\"x\"))","v":"10:30:00"},{"$f":"IF(Indtast!L30<>\"\",ROUND((60/$P17*Indtast!L$30),0)*$O$1+$B17,IF(Indtast!O31<>\"\",ROUND((60/$P17*Indtast!O$31),0)*$O$1+$B17,\"x\"))","v":"10:55:00"},{"$f":"IF(Indtast!M30<>\"\",ROUND((60/$P17*Indtast!M$30),0)*$O$1+$B17,IF(Indtast!P31<>\"\",ROUND((60/$P17*Indtast!P$31),0)*$O$1+$B17,\"x\"))","v":"11:20:00"},{"$f":"IF(Indtast!N30<>\"\",ROUND((60/$P17*Indtast!N$30),0)*$O$1+$B17,IF(Indtast!N31<>\"\",ROUND((60/$P17*Indtast!N$31),0)*$O$1+$B17,\"x\"))","v":"x"},{"$f":"IF(Indtast!O30<>\"\",ROUND((60/$P17*Indtast!O$30),0)*$O$1+$B17,IF(Indtast!O31<>\"\",ROUND((60/$P17*Indtast!O$31),0)*$O$1+$B17,\"x\"))","v":"x"},{"$f":"IF(Indtast!P30<>\"\",ROUND((60/$P17*Indtast!P$30),0)*$O$1+$B17,IF(Indtast!P31<>\"\",ROUND((60/$P17*Indtast!P$31),0)*$O$1+$B17,\"x\"))","v":"x"},{"$f":"IF(Indtast!Q30<>\"\",ROUND((60/$P17*Indtast!Q$30),0)*$O$1+$B17,IF(Indtast!Q31<>\"\",ROUND((60/$P17*Indtast!Q$31),0)*$O$1+$B17,\"x\"))","v":"x"},{"$f":"IF(Indtast!R30<>\"\",ROUND((60/$P17*Indtast!R$30),0)*$O$1+$B17,IF(Indtast!R31<>\"\",ROUND((60/$P17*Indtast!R$31),0)*$O$1+$B17,\"x\"))","v":"x"},{"$f":"IF(Indtast!S30<>\"\",ROUND((60/$P17*Indtast!S$30),0)*$O$1+$B17,IF(Indtast!S31<>\"\",ROUND((60/$P17*Indtast!S$31),0)*$O$1+$B17,\"x\"))","v":"x"},{"$f":"IF(Indtast!T30<>\"\",ROUND((60/$P17*Indtast!T$30),0)*$O$1+$B17,IF(Indtast!T31<>\"\",ROUND((60/$P17*Indtast!T$31),0)*$O$1+$B17,\"x\"))","v":"x"},null,{"$f":"Indtast!$E$30","v":36}]
[{"$f":"Indtast!A30&\" \"&Indtast!$D$2","v":"DB Mel"},{"$f":"IF(Indtast!$B$30<>\"\",Indtast!$B$30,\"\")","v":"09:15:00"},{"$f":"IF(Indtast!I30<>\"\",ROUND((60/$P18*Indtast!I$30),0)*$O$1+$B18,IF(Indtast!I31<>\"\",ROUND((60/$P18*Indtast!I$31),0)*$O$1+$B18,\"x\"))","v":"09:39:00"},{"$f":"IF(Indtast!J30<>\"\",ROUND((60/$P18*Indtast!J$30),0)*$O$1+$B18,IF(Indtast!J31<>\"\",ROUND((60/$P18*Indtast!J$31),0)*$O$1+$B18,\"x\"))","v":"10:04:00"},{"$f":"IF(Indtast!K30<>\"\",ROUND((60/$P18*Indtast!K$30),0)*$O$1+$B18,IF(Indtast!K31<>\"\",ROUND((60/$P18*Indtast!K$31),0)*$O$1+$B18,\"x\"))","v":"10:28:00"},{"$f":"IF(Indtast!L30<>\"\",ROUND((60/$P18*Indtast!L$30),0)*$O$1+$B18,IF(Indtast!O31<>\"\",ROUND((60/$P18*Indtast!O$31),0)*$O$1+$B18,\"x\"))","v":"10:52:00"},{"$f":"IF(Indtast!M30<>\"\",ROUND((60/$P18*Indtast!M$30),0)*$O$1+$B18,IF(Indtast!P31<>\"\",ROUND((60/$P18*Indtast!P$31),0)*$O$1+$B18,\"x\"))","v":"11:17:00"},{"$f":"IF(Indtast!N30<>\"\",ROUND((60/$P18*Indtast!N$30),0)*$O$1+$B18,IF(Indtast!N31<>\"\",ROUND((60/$P18*Indtast!N$31),0)*$O$1+$B18,\"x\"))","v":"x"},{"$f":"IF(Indtast!O30<>\"\",ROUND((60/$P18*Indtast!O$30),0)*$O$1+$B18,IF(Indtast!O31<>\"\",ROUND((60/$P18*Indtast!O$31),0)*$O$1+$B18,\"x\"))","v":"x"},{"$f":"IF(Indtast!P30<>\"\",ROUND((60/$P18*Indtast!P$30),0)*$O$1+$B18,IF(Indtast!P31<>\"\",ROUND((60/$P18*Indtast!P$31),0)*$O$1+$B18,\"x\"))","v":"x"},{"$f":"IF(Indtast!Q30<>\"\",ROUND((60/$P18*Indtast!Q$30),0)*$O$1+$B18,IF(Indtast!Q31<>\"\",ROUND((60/$P18*Indtast!Q$31),0)*$O$1+$B18,\"x\"))","v":"x"},{"$f":"IF(Indtast!R30<>\"\",ROUND((60/$P18*Indtast!R$30),0)*$O$1+$B18,IF(Indtast!R31<>\"\",ROUND((60/$P18*Indtast!R$31),0)*$O$1+$B18,\"x\"))","v":"x"},{"$f":"IF(Indtast!S30<>\"\",ROUND((60/$P18*Indtast!S$30),0)*$O$1+$B18,IF(Indtast!S31<>\"\",ROUND((60/$P18*Indtast!S$31),0)*$O$1+$B18,\"x\"))","v":"x"},{"$f":"IF(Indtast!T30<>\"\",ROUND((60/$P18*Indtast!T$30),0)*$O$1+$B18,IF(Indtast!T31<>\"\",ROUND((60/$P18*Indtast!T$31),0)*$O$1+$B18,\"x\"))","v":"x"},null,{"$f":"Indtast!$D$30","v":37}]
[{"$f":"Indtast!A30&\" \"&Indtast!$C$2","v":"DB Høj"},{"$f":"IF(Indtast!$B$30<>\"\",Indtast!$B$30,\"\")","v":"09:15:00"},{"$f":"IF(Indtast!I30<>\"\",ROUND((60/$P19*Indtast!I$30),0)*$O$1+$B19,IF(Indtast!I31<>\"\",ROUND((60/$P19*Indtast!I$31),0)*$O$1+$B19,\"x\"))","v":"09:39:00"},{"$f":"IF(Indtast!J30<>\"\",ROUND((60/$P19*Indtast!J$30),0)*$O$1+$B19,IF(Indtast!J31<>\"\",ROUND((60/$P19*Indtast!J$31),0)*$O$1+$B19,\"x\"))","v":"10:02:00"},{"$f":"IF(Indtast!K30<>\"\",ROUND((60/$P19*Indtast!K$30),0)*$O$1+$B19,IF(Indtast!K31<>\"\",ROUND((60/$P19*Indtast!K$31),0)*$O$1+$B19,\"x\"))","v":"10:26:00"},{"$f":"IF(Indtast!L30<>\"\",ROUND((60/$P19*Indtast!L$30),0)*$O$1+$B19,IF(Indtast!O31<>\"\",ROUND((60/$P19*Indtast!O$31),0)*$O$1+$B19,\"x\"))","v":"10:50:00"},{"$f":"IF(Indtast!M30<>\"\",ROUND((60/$P19*Indtast!M$30),0)*$O$1+$B19,IF(Indtast!P31<>\"\",ROUND((60/$P19*Indtast!P$31),0)*$O$1+$B19,\"x\"))","v":"11:13:00"},{"$f":"IF(Indtast!N30<>\"\",ROUND((60/$P19*Indtast!N$30),0)*$O$1+$B19,IF(Indtast!N31<>\"\",ROUND((60/$P19*Indtast!N$31),0)*$O$1+$B19,\"x\"))","v":"x"},{"$f":"IF(Indtast!O30<>\"\",ROUND((60/$P19*Indtast!O$30),0)*$O$1+$B19,IF(Indtast!O31<>\"\",ROUND((60/$P19*Indtast!O$31),0)*$O$1+$B19,\"x\"))","v":"x"},{"$f":"IF(Indtast!P30<>\"\",ROUND((60/$P19*Indtast!P$30),0)*$O$1+$B19,IF(Indtast!P31<>\"\",ROUND((60/$P19*Indtast!P$31),0)*$O$1+$B19,\"x\"))","v":"x"},{"$f":"IF(Indtast!Q30<>\"\",ROUND((60/$P19*Indtast!Q$30),0)*$O$1+$B19,IF(Indtast!Q31<>\"\",ROUND((60/$P19*Indtast!Q$31),0)*$O$1+$B19,\"x\"))","v":"x"},{"$f":"IF(Indtast!R30<>\"\",ROUND((60/$P19*Indtast!R$30),0)*$O$1+$B19,IF(Indtast!R31<>\"\",ROUND((60/$P19*Indtast!R$31),0)*$O$1+$B19,\"x\"))","v":"x"},{"$f":"IF(Indtast!S30<>\"\",ROUND((60/$P19*Indtast!S$30),0)*$O$1+$B19,IF(Indtast!S31<>\"\",ROUND((60/$P19*Indtast!S$31),0)*$O$1+$B19,\"x\"))","v":"x"},{"$f":"IF(Indtast!T30<>\"\",ROUND((60/$P19*Indtast!T$30),0)*$O$1+$B19,IF(Indtast!T31<>\"\",ROUND((60/$P19*Indtast!T$31),0)*$O$1+$B19,\"x\"))","v":"x"},null,{"$f":"Indtast!$C$30","v":38}]
[{"$f":"Indtast!$A12&\" \"&Indtast!$E$2","v":"U19 Lav"},{"$f":"IF(Indtast!$B$12<>\"\",Indtast!$B$12,\"\")","v":"09:30:00"},{"$f":"IF(Indtast!I12<>\"\",ROUND((60/$P20*Indtast!I$12),0)*$O$1+$B20,IF(Indtast!I13<>\"\",ROUND((60/$P20*Indtast!I$13),0)*$O$1+$B20,\"x\"))","v":"09:51:00"},{"$f":"IF(Indtast!J12<>\"\",ROUND((60/$P20*Indtast!J$12),0)*$O$1+$B20,IF(Indtast!J13<>\"\",ROUND((60/$P20*Indtast!J$13),0)*$O$1+$B20,\"x\"))","v":"10:13:00"},{"$f":"IF(Indtast!K12<>\"\",ROUND((60/$P20*Indtast!K$12),0)*$O$1+$B20,IF(Indtast!K13<>\"\",ROUND((60/$P20*Indtast!K$13),0)*$O$1+$B20,\"x\"))","v":"10:34:00"},{"$f":"IF(Indtast!L12<>\"\",ROUND((60/$P20*Indtast!L$12),0)*$O$1+$B20,IF(Indtast!L13<>\"\",ROUND((60/$P20*Indtast!L$13),0)*$O$1+$B20,\"x\"))","v":"10:56:00"},{"$f":"IF(Indtast!M12<>\"\",ROUND((60/$P20*Indtast!M$12),0)*$O$1+$B20,IF(Indtast!M13<>\"\",ROUND((60/$P20*Indtast!M$13),0)*$O$1+$B20,\"x\"))","v":"11:17:00"},{"$f":"IF(Indtast!N12<>\"\",ROUND((60/$P20*Indtast!N$12),0)*$O$1+$B20,IF(Indtast!N13<>\"\",ROUND((60/$P20*Indtast!N$13),0)*$O$1+$B20,\"x\"))","v":"11:39:00"},{"$f":"IF(Indtast!O12<>\"\",ROUND((60/$P20*Indtast!O$12),0)*$O$1+$B20,IF(Indtast!O13<>\"\",ROUND((60/$P20*Indtast!O$13),0)*$O$1+$B20,\"x\"))","v":"x"},{"$f":"IF(Indtast!P12<>\"\",ROUND((60/$P20*Indtast!P$12),0)*$O$1+$B20,IF(Indtast!P13<>\"\",ROUND((60/$P20*Indtast!P$13),0)*$O$1+$B20,\"x\"))","v":"x"},{"$f":"IF(Indtast!Q12<>\"\",ROUND((60/$P20*Indtast!Q$12),0)*$O$1+$B20,IF(Indtast!Q13<>\"\",ROUND((60/$P20*Indtast!Q$13),0)*$O$1+$B20,\"x\"))","v":"x"},{"$f":"IF(Indtast!R12<>\"\",ROUND((60/$P20*Indtast!R$12),0)*$O$1+$B20,IF(Indtast!R13<>\"\",ROUND((60/$P20*Indtast!R$13),0)*$O$1+$B20,\"x\"))","v":"x"},{"$f":"IF(Indtast!S12<>\"\",ROUND((60/$P20*Indtast!S$12),0)*$O$1+$B20,IF(Indtast!S13<>\"\",ROUND((60/$P20*Indtast!S$13),0)*$O$1+$B20,\"x\"))","v":"x"},{"$f":"IF(Indtast!T12<>\"\",ROUND((60/$P20*Indtast!T$12),0)*$O$1+$B20,IF(Indtast!T13<>\"\",ROUND((60/$P20*Indtast!T$13),0)*$O$1+$B20,\"x\"))","v":"x"},null,{"$f":"Indtast!$E$12","v":42}]
[{"$f":"Indtast!A12&\" \"&Indtast!$D$2","v":"U19 Mel"},{"$f":"IF(Indtast!$B$12<>\"\",Indtast!$B$12,\"\")","v":"09:30:00"},{"$f":"IF(Indtast!I12<>\"\",ROUND((60/$P21*Indtast!I$12),0)*$O$1+$B21,IF(Indtast!I13<>\"\",ROUND((60/$P21*Indtast!I$13),0)*$O$1+$B21,\"x\"))","v":"09:51:00"},{"$f":"IF(Indtast!J12<>\"\",ROUND((60/$P21*Indtast!J$12),0)*$O$1+$B21,IF(Indtast!J13<>\"\",ROUND((60/$P21*Indtast!J$13),0)*$O$1+$B21,\"x\"))","v":"10:12:00"},{"$f":"IF(Indtast!K12<>\"\",ROUND((60/$P21*Indtast!K$12),0)*$O$1+$B21,IF(Indtast!K13<>\"\",ROUND((60/$P21*Indtast!K$13),0)*$O$1+$B21,\"x\"))","v":"10:33:00"},{"$f":"IF(Indtast!L12<>\"\",ROUND((60/$P21*Indtast!L$12),0)*$O$1+$B21,IF(Indtast!L13<>\"\",ROUND((60/$P21*Indtast!L$13),0)*$O$1+$B21,\"x\"))","v":"10:54:00"},{"$f":"IF(Indtast!M12<>\"\",ROUND((60/$P21*Indtast!M$12),0)*$O$1+$B21,IF(Indtast!M13<>\"\",ROUND((60/$P21*Indtast!M$13),0)*$O$1+$B21,\"x\"))","v":"11:15:00"},{"$f":"IF(Indtast!N12<>\"\",ROUND((60/$P21*Indtast!N$12),0)*$O$1+$B21,IF(Indtast!N13<>\"\",ROUND((60/$P21*Indtast!N$13),0)*$O$1+$B21,\"x\"))","v":"11:36:00"},{"$f":"IF(Indtast!O12<>\"\",ROUND((60/$P21*Indtast!O$12),0)*$O$1+$B21,IF(Indtast!O13<>\"\",ROUND((60/$P21*Indtast!O$13),0)*$O$1+$B21,\"x\"))","v":"x"},{"$f":"IF(Indtast!P12<>\"\",ROUND((60/$P21*Indtast!P$12),0)*$O$1+$B21,IF(Indtast!P13<>\"\",ROUND((60/$P21*Indtast!P$13),0)*$O$1+$B21,\"x\"))","v":"x"},{"$f":"IF(Indtast!Q12<>\"\",ROUND((60/$P21*Indtast!Q$12),0)*$O$1+$B21,IF(Indtast!Q13<>\"\",ROUND((60/$P21*Indtast!Q$13),0)*$O$1+$B21,\"x\"))","v":"x"},{"$f":"IF(Indtast!R12<>\"\",ROUND((60/$P21*Indtast!R$12),0)*$O$1+$B21,IF(Indtast!R13<>\"\",ROUND((60/$P21*Indtast!R$13),0)*$O$1+$B21,\"x\"))","v":"x"},{"$f":"IF(Indtast!S12<>\"\",ROUND((60/$P21*Indtast!S$12),0)*$O$1+$B21,IF(Indtast!S13<>\"\",ROUND((60/$P21*Indtast!S$13),0)*$O$1+$B21,\"x\"))","v":"x"},{"$f":"IF(Indtast!T12<>\"\",ROUND((60/$P21*Indtast!T$12),0)*$O$1+$B21,IF(Indtast!T13<>\"\",ROUND((60/$P21*Indtast!T$13),0)*$O$1+$B21,\"x\"))","v":"x"},null,{"$f":"Indtast!$D$12","v":43}]
[{"$f":"Indtast!A12&\" \"&Indtast!$C$2","v":"U19 Høj"},{"$f":"IF(Indtast!$B$12<>\"\",Indtast!$B$12,\"\")","v":"09:30:00"},{"$f":"IF(Indtast!I12<>\"\",ROUND((60/$P22*Indtast!I$12),0)*$O$1+$B22,IF(Indtast!I13<>\"\",ROUND((60/$P22*Indtast!I$13),0)*$O$1+$B22,\"x\"))","v":"09:50:00"},{"$f":"IF(Indtast!J12<>\"\",ROUND((60/$P22*Indtast!J$12),0)*$O$1+$B22,IF(Indtast!J13<>\"\",ROUND((60/$P22*Indtast!J$13),0)*$O$1+$B22,\"x\"))","v":"10:11:00"},{"$f":"IF(Indtast!K12<>\"\",ROUND((60/$P22*Indtast!K$12),0)*$O$1+$B22,IF(Indtast!K13<>\"\",ROUND((60/$P22*Indtast!K$13),0)*$O$1+$B22,\"x\"))","v":"10:31:00"},{"$f":"IF(Indtast!L12<>\"\",ROUND((60/$P22*Indtast!L$12),0)*$O$1+$B22,IF(Indtast!L13<>\"\",ROUND((60/$P22*Indtast!L$13),0)*$O$1+$B22,\"x\"))","v":"10:52:00"},{"$f":"IF(Indtast!M12<>\"\",ROUND((60/$P22*Indtast!M$12),0)*$O$1+$B22,IF(Indtast!M13<>\"\",ROUND((60/$P22*Indtast!M$13),0)*$O$1+$B22,\"x\"))","v":"11:12:00"},{"$f":"IF(Indtast!N12<>\"\",ROUND((60/$P22*Indtast!N$12),0)*$O$1+$B22,IF(Indtast!N13<>\"\",ROUND((60/$P22*Indtast!N$13),0)*$O$1+$B22,\"x\"))","v":"11:33:00"},{"$f":"IF(Indtast!O12<>\"\",ROUND((60/$P22*Indtast!O$12),0)*$O$1+$B22,IF(Indtast!O13<>\"\",ROUND((60/$P22*Indtast!O$13),0)*$O$1+$B22,\"x\"))","v":"x"},{"$f":"IF(Indtast!P12<>\"\",ROUND((60/$P22*Indtast!P$12),0)*$O$1+$B22,IF(Indtast!P13<>\"\",ROUND((60/$P22*Indtast!P$13),0)*$O$1+$B22,\"x\"))","v":"x"},{"$f":"IF(Indtast!Q12<>\"\",ROUND((60/$P22*Indtast!Q$12),0)*$O$1+$B22,IF(Indtast!Q13<>\"\",ROUND((60/$P22*Indtast!Q$13),0)*$O$1+$B22,\"x\"))","v":"x"},{"$f":"IF(Indtast!R12<>\"\",ROUND((60/$P22*Indtast!R$12),0)*$O$1+$B22,IF(Indtast!R13<>\"\",ROUND((60/$P22*Indtast!R$13),0)*$O$1+$B22,\"x\"))","v":"x"},{"$f":"IF(Indtast!S12<>\"\",ROUND((60/$P22*Indtast!S$12),0)*$O$1+$B22,IF(Indtast!S13<>\"\",ROUND((60/$P22*Indtast!S$13),0)*$O$1+$B22,\"x\"))","v":"x"},{"$f":"IF(Indtast!T12<>\"\",ROUND((60/$P22*Indtast!T$12),0)*$O$1+$B22,IF(Indtast!T13<>\"\",ROUND((60/$P22*Indtast!T$13),0)*$O$1+$B22,\"x\"))","v":"x"},null,{"$f":"Indtast!$C$12","v":44}]
[{"$f":"Indtast!$A16&\" \"&Indtast!$E$2","v":"C Lav"},{"$f":"IF(Indtast!$B$16<>\"\",Indtast!$B$16,\"\")","v":"09:33:00"},{"$f":"IF(Indtast!I16<>\"\",ROUND((60/$P23*Indtast!I$16),0)*$O$1+$B23,IF(Indtast!I17<>\"\",ROUND((60/$P23*Indtast!I$17),0)*$O$1+$B23,\"x\"))","v":"09:55:00"},{"$f":"IF(Indtast!J16<>\"\",ROUND((60/$P23*Indtast!J$16),0)*$O$1+$B23,IF(Indtast!J17<>\"\",ROUND((60/$P23*Indtast!J$17),0)*$O$1+$B23,\"x\"))","v":"10:17:00"},{"$f":"IF(Indtast!K16<>\"\",ROUND((60/$P23*Indtast!K$16),0)*$O$1+$B23,IF(Indtast!K17<>\"\",ROUND((60/$P23*Indtast!K$17),0)*$O$1+$B23,\"x\"))","v":"10:39:00"},{"$f":"IF(Indtast!L16<>\"\",ROUND((60/$P23*Indtast!L$16),0)*$O$1+$B23,IF(Indtast!L17<>\"\",ROUND((60/$P23*Indtast!L$17),0)*$O$1+$B23,\"x\"))","v":"11:01:00"},{"$f":"IF(Indtast!M16<>\"\",ROUND((60/$P23*Indtast!M$16),0)*$O$1+$B23,IF(Indtast!M17<>\"\",ROUND((60/$P23*Indtast!M$17),0)*$O$1+$B23,\"x\"))","v":"11:23:00"},{"$f":"IF(Indtast!N16<>\"\",ROUND((60/$P23*Indtast!N$16),0)*$O$1+$B23,IF(Indtast!N17<>\"\",ROUND((60/$P23*Indtast!N$17),0)*$O$1+$B23,\"x\"))","v":"11:45:00"},{"$f":"IF(Indtast!O16<>\"\",ROUND((60/$P23*Indtast!O$16),0)*$O$1+$B23,IF(Indtast!O17<>\"\",ROUND((60/$P23*Indtast!O$17),0)*$O$1+$B23,\"x\"))","v":"12:07:00"},{"$f":"IF(Indtast!P16<>\"\",ROUND((60/$P23*Indtast!P$16),0)*$O$1+$B23,IF(Indtast!P17<>\"\",ROUND((60/$P23*Indtast!P$17),0)*$O$1+$B23,\"x\"))","v":"12:29:00"},{"$f":"IF(Indtast!Q16<>\"\",ROUND((60/$P23*Indtast!Q$16),0)*$O$1+$B23,IF(Indtast!Q17<>\"\",ROUND((60/$P23*Indtast!Q$17),0)*$O$1+$B23,\"x\"))","v":"x"},{"$f":"IF(Indtast!R16<>\"\",ROUND((60/$P23*Indtast!R$16),0)*$O$1+$B23,IF(Indtast!R17<>\"\",ROUND((60/$P23*Indtast!R$17),0)*$O$1+$B23,\"x\"))","v":"x"},{"$f":"IF(Indtast!S16<>\"\",ROUND((60/$P23*Indtast!S$16),0)*$O$1+$B23,IF(Indtast!S17<>\"\",ROUND((60/$P23*Indtast!S$17),0)*$O$1+$B23,\"x\"))","v":"x"},{"$f":"IF(Indtast!T16<>\"\",ROUND((60/$P23*Indtast!T$16),0)*$O$1+$B23,IF(Indtast!T17<>\"\",ROUND((60/$P23*Indtast!T$17),0)*$O$1+$B23,\"x\"))","v":"x"},null,{"$f":"Indtast!$E$16","v":41}]
[{"$f":"Indtast!A16&\" \"&Indtast!$D$2","v":"C Mel"},{"$f":"IF(Indtast!$B$16<>\"\",Indtast!$B$16,\"\")","v":"09:33:00"},{"$f":"IF(Indtast!I16<>\"\",ROUND((60/$P24*Indtast!I$16),0)*$O$1+$B24,IF(Indtast!I17<>\"\",ROUND((60/$P24*Indtast!I$17),0)*$O$1+$B24,\"x\"))","v":"09:54:00"},{"$f":"IF(Indtast!J16<>\"\",ROUND((60/$P24*Indtast!J$16),0)*$O$1+$B24,IF(Indtast!J17<>\"\",ROUND((60/$P24*Indtast!J$17),0)*$O$1+$B24,\"x\"))","v":"10:16:00"},{"$f":"IF(Indtast!K16<>\"\",ROUND((60/$P24*Indtast!K$16),0)*$O$1+$B24,IF(Indtast!K17<>\"\",ROUND((60/$P24*Indtast!K$17),0)*$O$1+$B24,\"x\"))","v":"10:37:00"},{"$f":"IF(Indtast!L16<>\"\",ROUND((60/$P24*Indtast!L$16),0)*$O$1+$B24,IF(Indtast!L17<>\"\",ROUND((60/$P24*Indtast!L$17),0)*$O$1+$B24,\"x\"))","v":"10:59:00"},{"$f":"IF(Indtast!M16<>\"\",ROUND((60/$P24*Indtast!M$16),0)*$O$1+$B24,IF(Indtast!M17<>\"\",ROUND((60/$P24*Indtast!M$17),0)*$O$1+$B24,\"x\"))","v":"11:20:00"},{"$f":"IF(Indtast!N16<>\"\",ROUND((60/$P24*Indtast!N$16),0)*$O$1+$B24,IF(Indtast!N17<>\"\",ROUND((60/$P24*Indtast!N$17),0)*$O$1+$B24,\"x\"))","v":"11:42:00"},{"$f":"IF(Indtast!O16<>\"\",ROUND((60/$P24*Indtast!O$16),0)*$O$1+$B24,IF(Indtast!O17<>\"\",ROUND((60/$P24*Indtast!O$17),0)*$O$1+$B24,\"x\"))","v":"12:03:00"},{"$f":"IF(Indtast!P16<>\"\",ROUND((60/$P24*Indtast!P$16),0)*$O$1+$B24,IF(Indtast!P17<>\"\",ROUND((60/$P24*Indtast!P$17),0)*$O$1+$B24,\"x\"))","v":"12:24:00"},{"$f":"IF(Indtast!Q16<>\"\",ROUND((60/$P24*Indtast!Q$16),0)*$O$1+$B24,IF(Indtast!Q17<>\"\",ROUND((60/$P24*Indtast!Q$17),0)*$O$1+$B24,\"x\"))","v":"x"},{"$f":"IF(Indtast!R16<>\"\",ROUND((60/$P24*Indtast!R$16),0)*$O$1+$B24,IF(Indtast!R17<>\"\",ROUND((60/$P24*Indtast!R$17),0)*$O$1+$B24,\"x\"))","v":"x"},{"$f":"IF(Indtast!S16<>\"\",ROUND((60/$P24*Indtast!S$16),0)*$O$1+$B24,IF(Indtast!S17<>\"\",ROUND((60/$P24*Indtast!S$17),0)*$O$1+$B24,\"x\"))","v":"x"},{"$f":"IF(Indtast!T16<>\"\",ROUND((60/$P24*Indtast!T$16),0)*$O$1+$B24,IF(Indtast!T17<>\"\",ROUND((60/$P24*Indtast!T$17),0)*$O$1+$B24,\"x\"))","v":"x"},null,{"$f":"Indtast!$D$16","v":42}]
[{"$f":"Indtast!A16&\" \"&Indtast!$C$2","v":"C Høj"},{"$f":"IF(Indtast!$B$16<>\"\",Indtast!$B$16,\"\")","v":"09:33:00"},{"$f":"IF(Indtast!I16<>\"\",ROUND((60/$P25*Indtast!I$16),0)*$O$1+$B25,IF(Indtast!I17<>\"\",ROUND((60/$P25*Indtast!I$17),0)*$O$1+$B25,\"x\"))","v":"09:54:00"},{"$f":"IF(Indtast!J16<>\"\",ROUND((60/$P25*Indtast!J$16),0)*$O$1+$B25,IF(Indtast!J17<>\"\",ROUND((60/$P25*Indtast!J$17),0)*$O$1+$B25,\"x\"))","v":"10:15:00"},{"$f":"IF(Indtast!K16<>\"\",ROUND((60/$P25*Indtast!K$16),0)*$O$1+$B25,IF(Indtast!K17<>\"\",ROUND((60/$P25*Indtast!K$17),0)*$O$1+$B25,\"x\"))","v":"10:36:00"},{"$f":"IF(Indtast!L16<>\"\",ROUND((60/$P25*Indtast!L$16),0)*$O$1+$B25,IF(Indtast!L17<>\"\",ROUND((60/$P25*Indtast!L$17),0)*$O$1+$B25,\"x\"))","v":"10:57:00"},{"$f":"IF(Indtast!M16<>\"\",ROUND((60/$P25*Indtast!M$16),0)*$O$1+$B25,IF(Indtast!M17<>\"\",ROUND((60/$P25*Indtast!M$17),0)*$O$1+$B25,\"x\"))","v":"11:18:00"},{"$f":"IF(Indtast!N16<>\"\",ROUND((60/$P25*Indtast!N$16),0)*$O$1+$B25,IF(Indtast!N17<>\"\",ROUND((60/$P25*Indtast!N$17),0)*$O$1+$B25,\"x\"))","v":"11:39:00"},{"$f":"IF(Indtast!O16<>\"\",ROUND((60/$P25*Indtast!O$16),0)*$O$1+$B25,IF(Indtast!O17<>\"\",ROUND((60/$P25*Indtast!O$17),0)*$O$1+$B25,\"x\"))","v":"12:00:00"},{"$f":"IF(Indtast!P16<>\"\",ROUND((60/$P25*Indtast!P$16),0)*$O$1+$B25,IF(Indtast!P17<>\"\",ROUND((60/$P25*Indtast!P$17),0)*$O$1+$B25,\"x\"))","v":"12:20:00"},{"$f":"IF(Indtast!Q16<>\"\",ROUND((60/$P25*Indtast!Q$16),0)*$O$1+$B25,IF(Indtast!Q17<>\"\",ROUND((60/$P25*Indtast!Q$17),0)*$O$1+$B25,\"x\"))","v":"x"},{"$f":"IF(Indtast!R16<>\"\",ROUND((60/$P25*Indtast!R$16),0)*$O$1+$B25,IF(Indtast!R17<>\"\",ROUND((60/$P25*Indtast!R$17),0)*$O$1+$B25,\"x\"))","v":"x"},{"$f":"IF(Indtast!S16<>\"\",ROUND((60/$P25*Indtast!S$16),0)*$O$1+$B25,IF(Indtast!S17<>\"\",ROUND((60/$P25*Indtast!S$17),0)*$O$1+$B25,\"x\"))","v":"x"},{"$f":"IF(Indtast!T16<>\"\",ROUND((60/$P25*Indtast!T$16),0)*$O$1+$B25,IF(Indtast!T17<>\"\",ROUND((60/$P25*Indtast!T$17),0)*$O$1+$B25,\"x\"))","v":"x"},null,{"$f":"Indtast!$C$16","v":43}]
[{"$f":"Indtast!$A28&\" \"&Indtast!$E$2","v":"DA Lav"},{"$f":"IF(Indtast!$B$28<>\"\",Indtast!$B$28,\"\")","v":"09:33:00"},{"$f":"IF(Indtast!I28<>\"\",ROUND((60/$P26*Indtast!I$28),0)*$O$1+$B26,IF(Indtast!I29<>\"\",ROUND((60/$P26*Indtast!I$29),0)*$O$1+$B26,\"x\"))","v":"09:55:00"},{"$f":"IF(Indtast!J28<>\"\",ROUND((60/$P26*Indtast!J$28),0)*$O$1+$B26,IF(Indtast!J29<>\"\",ROUND((60/$P26*Indtast!J$29),0)*$O$1+$B26,\"x\"))","v":"10:17:00"},{"$f":"IF(Indtast!K28<>\"\",ROUND((60/$P26*Indtast!K$28),0)*$O$1+$B26,IF(Indtast!K29<>\"\",ROUND((60/$P26*Indtast!K$29),0)*$O$1+$B26,\"x\"))","v":"10:39:00"},{"$f":"IF(Indtast!L28<>\"\",ROUND((60/$P26*Indtast!L$28),0)*$O$1+$B26,IF(Indtast!L29<>\"\",ROUND((60/$P26*Indtast!L$29),0)*$O$1+$B26,\"x\"))","v":"11:01:00"},{"$f":"IF(Indtast!M28<>\"\",ROUND((60/$P26*Indtast!M$28),0)*$O$1+$B26,IF(Indtast!M29<>\"\",ROUND((60/$P26*Indtast!M$29),0)*$O$1+$B26,\"x\"))","v":"11:23:00"},{"$f":"IF(Indtast!N28<>\"\",ROUND((60/$P26*Indtast!N$28),0)*$O$1+$B26,IF(Indtast!N29<>\"\",ROUND((60/$P26*Indtast!N$29),0)*$O$1+$B26,\"x\"))","v":"11:45:00"},{"$f":"IF(Indtast!O28<>\"\",ROUND((60/$P26*Indtast!O$28),0)*$O$1+$B26,IF(Indtast!O29<>\"\",ROUND((60/$P26*Indtast!O$29),0)*$O$1+$B26,\"x\"))","v":"12:07:00"},{"$f":"IF(Indtast!P28<>\"\",ROUND((60/$P26*Indtast!P$28),0)*$O$1+$B26,IF(Indtast!P29<>\"\",ROUND((60/$P26*Indtast!P$29),0)*$O$1+$B26,\"x\"))","v":"12:29:00"},{"$f":"IF(Indtast!Q28<>\"\",ROUND((60/$P26*Indtast!Q$28),0)*$O$1+$B26,IF(Indtast!Q29<>\"\",ROUND((60/$P26*Indtast!Q$29),0)*$O$1+$B26,\"x\"))","v":"12:51:00"},{"$f":"IF(Indtast!R28<>\"\",ROUND((60/$P26*Indtast!R$28),0)*$O$1+$B26,IF(Indtast!R29<>\"\",ROUND((60/$P26*Indtast!R$29),0)*$O$1+$B26,\"x\"))","v":"x"},{"$f":"IF(Indtast!S28<>\"\",ROUND((60/$P26*Indtast!S$28),0)*$O$1+$B26,IF(Indtast!S29<>\"\",ROUND((60/$P26*Indtast!S$29),0)*$O$1+$B26,\"x\"))","v":"x"},{"$f":"IF(Indtast!T28<>\"\",ROUND((60/$P26*Indtast!T$28),0)*$O$1+$B26,IF(Indtast!T29<>\"\",ROUND((60/$P26*Indtast!T$29),0)*$O$1+$B26,\"x\"))","v":"x"},null,{"$f":"Indtast!$E$28","v":41}]
[{"$f":"Indtast!A28&\" \"&Indtast!$D$2","v":"DA Mel"},{"$f":"IF(Indtast!$B$28<>\"\",Indtast!$B$28,\"\")","v":"09:33:00"},{"$f":"IF(Indtast!I28<>\"\",ROUND((60/$P27*Indtast!I$28),0)*$O$1+$B27,IF(Indtast!I29<>\"\",ROUND((60/$P27*Indtast!I$29),0)*$O$1+$B27,\"x\"))","v":"09:54:00"},{"$f":"IF(Indtast!J28<>\"\",ROUND((60/$P27*Indtast!J$28),0)*$O$1+$B27,IF(Indtast!J29<>\"\",ROUND((60/$P27*Indtast!J$29),0)*$O$1+$B27,\"x\"))","v":"10:16:00"},{"$f":"IF(Indtast!K28<>\"\",ROUND((60/$P27*Indtast!K$28),0)*$O$1+$B27,IF(Indtast!K29<>\"\",ROUND((60/$P27*Indtast!K$29),0)*$O$1+$B27,\"x\"))","v":"10:37:00"},{"$f":"IF(Indtast!L28<>\"\",ROUND((60/$P27*Indtast!L$28),0)*$O$1+$B27,IF(Indtast!L29<>\"\",ROUND((60/$P27*Indtast!L$29),0)*$O$1+$B27,\"x\"))","v":"10:59:00"},{"$f":"IF(Indtast!M28<>\"\",ROUND((60/$P27*Indtast!M$28),0)*$O$1+$B27,IF(Indtast!M29<>\"\",ROUND((60/$P27*Indtast!M$29),0)*$O$1+$B27,\"x\"))","v":"11:20:00"},{"$f":"IF(Indtast!N28<>\"\",ROUND((60/$P27*Indtast!N$28),0)*$O$1+$B27,IF(Indtast!N29<>\"\",ROUND((60/$P27*Indtast!N$29),0)*$O$1+$B27,\"x\"))","v":"11:42:00"},{"$f":"IF(Indtast!O28<>\"\",ROUND((60/$P27*Indtast!O$28),0)*$O$1+$B27,IF(Indtast!O29<>\"\",ROUND((60/$P27*Indtast!O$29),0)*$O$1+$B27,\"x\"))","v":"12:03:00"},{"$f":"IF(Indtast!P28<>\"\",ROUND((60/$P27*Indtast!P$28),0)*$O$1+$B27,IF(Indtast!P29<>\"\",ROUND((60/$P27*Indtast!P$29),0)*$O$1+$B27,\"x\"))","v":"12:24:00"},{"$f":"IF(Indtast!Q28<>\"\",ROUND((60/$P27*Indtast!Q$28),0)*$O$1+$B27,IF(Indtast!Q29<>\"\",ROUND((60/$P27*Indtast!Q$29),0)*$O$1+$B27,\"x\"))","v":"12:46:00"},{"$f":"IF(Indtast!R28<>\"\",ROUND((60/$P27*Indtast!R$28),0)*$O$1+$B27,IF(Indtast!R29<>\"\",ROUND((60/$P27*Indtast!R$29),0)*$O$1+$B27,\"x\"))","v":"x"},{"$f":"IF(Indtast!S28<>\"\",ROUND((60/$P27*Indtast!S$28),0)*$O$1+$B27,IF(Indtast!S29<>\"\",ROUND((60/$P27*Indtast!S$29),0)*$O$1+$B27,\"x\"))","v":"x"},{"$f":"IF(Indtast!T28<>\"\",ROUND((60/$P27*Indtast!T$28),0)*$O$1+$B27,IF(Indtast!T29<>\"\",ROUND((60/$P27*Indtast!T$29),0)*$O$1+$B27,\"x\"))","v":"x"},null,{"$f":"Indtast!$D$28","v":42}]
[{"$f":"Indtast!A28&\" \"&Indtast!$C$2","v":"DA Høj"},{"$f":"IF(Indtast!$B$28<>\"\",Indtast!$B$28,\"\")","v":"09:33:00"},{"$f":"IF(Indtast!I28<>\"\",ROUND((60/$P28*Indtast!I$28),0)*$O$1+$B28,IF(Indtast!I29<>\"\",ROUND((60/$P28*Indtast!I$29),0)*$O$1+$B28,\"x\"))","v":"09:54:00"},{"$f":"IF(Indtast!J28<>\"\",ROUND((60/$P28*Indtast!J$28),0)*$O$1+$B28,IF(Indtast!J29<>\"\",ROUND((60/$P28*Indtast!J$29),0)*$O$1+$B28,\"x\"))","v":"10:15:00"},{"$f":"IF(Indtast!K28<>\"\",ROUND((60/$P28*Indtast!K$28),0)*$O$1+$B28,IF(Indtast!K29<>\"\",ROUND((60/$P28*Indtast!K$29),0)*$O$1+$B28,\"x\"))","v":"10:36:00"},{"$f":"IF(Indtast!L28<>\"\",ROUND((60/$P28*Indtast!L$28),0)*$O$1+$B28,IF(Indtast!L29<>\"\",ROUND((60/$P28*Indtast!L$29),0)*$O$1+$B28,\"x\"))","v":"10:57:00"},{"$f":"IF(Indtast!M28<>\"\",ROUND((60/$P28*Indtast!M$28),0)*$O$1+$B28,IF(Indtast!M29<>\"\",ROUND((60/$P28*Indtast!M$29),0)*$O$1+$B28,\"x\"))","v":"11:18:00"},{"$f":"IF(Indtast!N28<>\"\",ROUND((60/$P28*Indtast!N$28),0)*$O$1+$B28,IF(Indtast!N29<>\"\",ROUND((60/$P28*Indtast!N$29),0)*$O$1+$B28,\"x\"))","v":"11:39:00"},{"$f":"IF(Indtast!O28<>\"\",ROUND((60/$P28*Indtast!O$28),0)*$O$1+$B28,IF(Indtast!O29<>\"\",ROUND((60/$P28*Indtast!O$29),0)*$O$1+$B28,\"x\"))","v":"12:00:00"},{"$f":"IF(Indtast!P28<>\"\",ROUND((60/$P28*Indtast!P$28),0)*$O$1+$B28,IF(Indtast!P29<>\"\",ROUND((60/$P28*Indtast!P$29),0)*$O$1+$B28,\"x\"))","v":"12:20:00"},{"$f":"IF(Indtast!Q28<>\"\",ROUND((60/$P28*Indtast!Q$28),0)*$O$1+$B28,IF(Indtast!Q29<>\"\",ROUND((60/$P28*Indtast!Q$29),0)*$O$1+$B28,\"x\"))","v":"12:41:00"},{"$f":"IF(Indtast!R28<>\"\",ROUND((60/$P28*Indtast!R$28),0)*$O$1+$B28,IF(Indtast!R29<>\"\",ROUND((60/$P28*Indtast!R$29),0)*$O$1+$B28,\"x\"))","v":"x"},{"$f":"IF(Indtast!S28<>\"\",ROUND((60/$P28*Indtast!S$28),0)*$O$1+$B28,IF(Indtast!S29<>\"\",ROUND((60/$P28*Indtast!S$29),0)*$O$1+$B28,\"x\"))","v":"x"},{"$f":"IF(Indtast!T28<>\"\",ROUND((60/$P28*Indtast!T$28),0)*$O$1+$B28,IF(Indtast!T29<>\"\",ROUND((60/$P28*Indtast!T$29),0)*$O$1+$B28,\"x\"))","v":"x"},null,{"$f":"Indtast!$C$28","v":43}]
[{"$f":"Indtast!$A14&\" \"&Indtast!$E$2","v":"D Lav"},{"$f":"IF(Indtast!$B$14<>\"\",Indtast!$B$14,\"\")","v":"09:35:00"},{"$f":"IF(Indtast!I14<>\"\",ROUND((60/$P29*Indtast!I$14),0)*$O$1+$B29,IF(Indtast!I15<>\"\",ROUND((60/$P29*Indtast!I$15),0)*$O$1+$B29,\"x\"))","v":"09:58:00"},{"$f":"IF(Indtast!J14<>\"\",ROUND((60/$P29*Indtast!J$14),0)*$O$1+$B29,IF(Indtast!J15<>\"\",ROUND((60/$P29*Indtast!J$15),0)*$O$1+$B29,\"x\"))","v":"10:20:00"},{"$f":"IF(Indtast!K14<>\"\",ROUND((60/$P29*Indtast!K$14),0)*$O$1+$B29,IF(Indtast!K15<>\"\",ROUND((60/$P29*Indtast!K$15),0)*$O$1+$B29,\"x\"))","v":"10:43:00"},{"$f":"IF(Indtast!L14<>\"\",ROUND((60/$P29*Indtast!L$14),0)*$O$1+$B29,IF(Indtast!L15<>\"\",ROUND((60/$P29*Indtast!L$15),0)*$O$1+$B29,\"x\"))","v":"11:05:00"},{"$f":"IF(Indtast!M14<>\"\",ROUND((60/$P29*Indtast!M$14),0)*$O$1+$B29,IF(Indtast!M15<>\"\",ROUND((60/$P29*Indtast!M$15),0)*$O$1+$B29,\"x\"))","v":"11:28:00"},{"$f":"IF(Indtast!N14<>\"\",ROUND((60/$P29*Indtast!N$14),0)*$O$1+$B29,IF(Indtast!N15<>\"\",ROUND((60/$P29*Indtast!N$15),0)*$O$1+$B29,\"x\"))","v":"11:50:00"},{"$f":"IF(Indtast!O14<>\"\",ROUND((60/$P29*Indtast!O$14),0)*$O$1+$B29,IF(Indtast!O15<>\"\",ROUND((60/$P29*Indtast!O$15),0)*$O$1+$B29,\"x\"))","v":"x"},{"$f":"IF(Indtast!P14<>\"\",ROUND((60/$P29*Indtast!P$14),0)*$O$1+$B29,IF(Indtast!P15<>\"\",ROUND((60/$P29*Indtast!P$15),0)*$O$1+$B29,\"x\"))","v":"x"},{"$f":"IF(Indtast!Q14<>\"\",ROUND((60/$P29*Indtast!Q$14),0)*$O$1+$B29,IF(Indtast!Q15<>\"\",ROUND((60/$P29*Indtast!Q$15),0)*$O$1+$B29,\"x\"))","v":"x"},{"$f":"IF(Indtast!R14<>\"\",ROUND((60/$P29*Indtast!R$14),0)*$O$1+$B29,IF(Indtast!R15<>\"\",ROUND((60/$P29*Indtast!R$15),0)*$O$1+$B29,\"x\"))","v":"x"},{"$f":"IF(Indtast!S14<>\"\",ROUND((60/$P29*Indtast!S$14),0)*$O$1+$B29,IF(Indtast!S15<>\"\",ROUND((60/$P29*Indtast!S$15),0)*$O$1+$B29,\"x\"))","v":"x"},{"$f":"IF(Indtast!T14<>\"\",ROUND((60/$P29*Indtast!T$14),0)*$O$1+$B29,IF(Indtast!T15<>\"\",ROUND((60/$P29*Indtast!T$15),0)*$O$1+$B29,\"x\"))","v":"x"},null,{"$f":"Indtast!$E$14","v":40}]
[{"$f":"Indtast!A14&\" \"&Indtast!$D$2","v":"D Mel"},{"$f":"IF(Indtast!$B$14<>\"\",Indtast!$B$14,\"\")","v":"09:35:00"},{"$f":"IF(Indtast!I14<>\"\",ROUND((60/$P30*Indtast!I$14),0)*$O$1+$B30,IF(Indtast!I15<>\"\",ROUND((60/$P30*Indtast!I$15),0)*$O$1+$B30,\"x\"))","v":"09:57:00"},{"$f":"IF(Indtast!J14<>\"\",ROUND((60/$P30*Indtast!J$14),0)*$O$1+$B30,IF(Indtast!J15<>\"\",ROUND((60/$P30*Indtast!J$15),0)*$O$1+$B30,\"x\"))","v":"10:19:00"},{"$f":"IF(Indtast!K14<>\"\",ROUND((60/$P30*Indtast!K$14),0)*$O$1+$B30,IF(Indtast!K15<>\"\",ROUND((60/$P30*Indtast!K$15),0)*$O$1+$B30,\"x\"))","v":"10:41:00"},{"$f":"IF(Indtast!L14<>\"\",ROUND((60/$P30*Indtast!L$14),0)*$O$1+$B30,IF(Indtast!L15<>\"\",ROUND((60/$P30*Indtast!L$15),0)*$O$1+$B30,\"x\"))","v":"11:03:00"},{"$f":"IF(Indtast!M14<>\"\",ROUND((60/$P30*Indtast!M$14),0)*$O$1+$B30,IF(Indtast!M15<>\"\",ROUND((60/$P30*Indtast!M$15),0)*$O$1+$B30,\"x\"))","v":"11:25:00"},{"$f":"IF(Indtast!N14<>\"\",ROUND((60/$P30*Indtast!N$14),0)*$O$1+$B30,IF(Indtast!N15<>\"\",ROUND((60/$P30*Indtast!N$15),0)*$O$1+$B30,\"x\"))","v":"11:47:00"},{"$f":"IF(Indtast!O14<>\"\",ROUND((60/$P30*Indtast!O$14),0)*$O$1+$B30,IF(Indtast!O15<>\"\",ROUND((60/$P30*Indtast!O$15),0)*$O$1+$B30,\"x\"))","v":"x"},{"$f":"IF(Indtast!P14<>\"\",ROUND((60/$P30*Indtast!P$14),0)*$O$1+$B30,IF(Indtast!P15<>\"\",ROUND((60/$P30*Indtast!P$15),0)*$O$1+$B30,\"x\"))","v":"x"},{"$f":"IF(Indtast!Q14<>\"\",ROUND((60/$P30*Indtast!Q$14),0)*$O$1+$B30,IF(Indtast!Q15<>\"\",ROUND((60/$P30*Indtast!Q$15),0)*$O$1+$B30,\"x\"))","v":"x"},{"$f":"IF(Indtast!R14<>\"\",ROUND((60/$P30*Indtast!R$14),0)*$O$1+$B30,IF(Indtast!R15<>\"\",ROUND((60/$P30*Indtast!R$15),0)*$O$1+$B30,\"x\"))","v":"x"},{"$f":"IF(Indtast!S14<>\"\",ROUND((60/$P30*Indtast!S$14),0)*$O$1+$B30,IF(Indtast!S15<>\"\",ROUND((60/$P30*Indtast!S$15),0)*$O$1+$B30,\"x\"))","v":"x"},{"$f":"IF(Indtast!T14<>\"\",ROUND((60/$P30*Indtast!T$14),0)*$O$1+$B30,IF(Indtast!T15<>\"\",ROUND((60/$P30*Indtast!T$15),0)*$O$1+$B30,\"x\"))","v":"x"},null,{"$f":"Indtast!$D$14","v":41}]
[{"$f":"Indtast!A14&\" \"&Indtast!$C$2","v":"D Høj"},{"$f":"IF(Indtast!$B$14<>\"\",Indtast!$B$14,\"\")","v":"09:35:00"},{"$f":"IF(Indtast!I14<>\"\",ROUND((60/$P31*Indtast!I$14),0)*$O$1+$B31,IF(Indtast!I15<>\"\",ROUND((60/$P31*Indtast!I$15),0)*$O$1+$B31,\"x\"))","v":"09:56:00"},{"$f":"IF(Indtast!J14<>\"\",ROUND((60/$P31*Indtast!J$14),0)*$O$1+$B31,IF(Indtast!J15<>\"\",ROUND((60/$P31*Indtast!J$15),0)*$O$1+$B31,\"x\"))","v":"10:18:00"},{"$f":"IF(Indtast!K14<>\"\",ROUND((60/$P31*Indtast!K$14),0)*$O$1+$B31,IF(Indtast!K15<>\"\",ROUND((60/$P31*Indtast!K$15),0)*$O$1+$B31,\"x\"))","v":"10:39:00"},{"$f":"IF(Indtast!L14<>\"\",ROUND((60/$P31*Indtast!L$14),0)*$O$1+$B31,IF(Indtast!L15<>\"\",ROUND((60/$P31*Indtast!L$15),0)*$O$1+$B31,\"x\"))","v":"11:01:00"},{"$f":"IF(Indtast!M14<>\"\",ROUND((60/$P31*Indtast!M$14),0)*$O$1+$B31,IF(Indtast!M15<>\"\",ROUND((60/$P31*Indtast!M$15),0)*$O$1+$B31,\"x\"))","v":"11:22:00"},{"$f":"IF(Indtast!N14<>\"\",ROUND((60/$P31*Indtast!N$14),0)*$O$1+$B31,IF(Indtast!N15<>\"\",ROUND((60/$P31*Indtast!N$15),0)*$O$1+$B31,\"x\"))","v":"11:44:00"},{"$f":"IF(Indtast!O14<>\"\",ROUND((60/$P31*Indtast!O$14),0)*$O$1+$B31,IF(Indtast!O15<>\"\",ROUND((60/$P31*Indtast!O$15),0)*$O$1+$B31,\"x\"))","v":"x"},{"$f":"IF(Indtast!P14<>\"\",ROUND((60/$P31*Indtast!P$14),0)*$O$1+$B31,IF(Indtast!P15<>\"\",ROUND((60/$P31*Indtast!P$15),0)*$O$1+$B31,\"x\"))","v":"x"},{"$f":"IF(Indtast!Q14<>\"\",ROUND((60/$P31*Indtast!Q$14),0)*$O$1+$B31,IF(Indtast!Q15<>\"\",ROUND((60/$P31*Indtast!Q$15),0)*$O$1+$B31,\"x\"))","v":"x"},{"$f":"IF(Indtast!R14<>\"\",ROUND((60/$P31*Indtast!R$14),0)*$O$1+$B31,IF(Indtast!R15<>\"\",ROUND((60/$P31*Indtast!R$15),0)*$O$1+$B31,\"x\"))","v":"x"},{"$f":"IF(Indtast!S14<>\"\",ROUND((60/$P31*Indtast!S$14),0)*$O$1+$B31,IF(Indtast!S15<>\"\",ROUND((60/$P31*Indtast!S$15),0)*$O$1+$B31,\"x\"))","v":"x"},{"$f":"IF(Indtast!T14<>\"\",ROUND((60/$P31*Indtast!T$14),0)*$O$1+$B31,IF(Indtast!T15<>\"\",ROUND((60/$P31*Indtast!T$15),0)*$O$1+$B31,\"x\"))","v":"x"},null,{"$f":"Indtast!$C$14","v":42}]
[{"$f":"Indtast!$A20&\" \"&Indtast!$E$2","v":"H40 Lav"},{"$f":"IF(Indtast!$B$20<>\"\",Indtast!$B$20,\"\")","v":"12:30:00"},{"$f":"IF(Indtast!I20<>\"\",ROUND((60/$P32*Indtast!I$20),0)*$O$1+$B32,IF(Indtast!I21<>\"\",ROUND((60/$P32*Indtast!I$21),0)*$O$1+$B32,\"x\"))","v":"12:53:00"},{"$f":"IF(Indtast!J20<>\"\",ROUND((60/$P32*Indtast!J$20),0)*$O$1+$B32,IF(Indtast!J21<>\"\",ROUND((60/$P32*Indtast!J$21),0)*$O$1+$B32,\"x\"))","v":"13:15:00"},{"$f":"IF(Indtast!K20<>\"\",ROUND((60/$P32*Indtast!K$20),0)*$O$1+$B32,IF(Indtast!K21<>\"\",ROUND((60/$P32*Indtast!K$21),0)*$O$1+$B32,\"x\"))","v":"13:38:00"},{"$f":"IF(Indtast!L20<>\"\",ROUND((60/$P32*Indtast!L$20),0)*$O$1+$B32,IF(Indtast!L21<>\"\",ROUND((60/$P32*Indtast!L$21),0)*$O$1+$B32,\"x\"))","v":"14:00:00"},{"$f":"IF(Indtast!M20<>\"\",ROUND((60/$P32*Indtast!M$20),0)*$O$1+$B32,IF(Indtast!M21<>\"\",ROUND((60/$P32*Indtast!M$21),0)*$O$1+$B32,\"x\"))","v":"14:23:00"},{"$f":"IF(Indtast!N20<>\"\",ROUND((60/$P32*Indtast!N$20),0)*$O$1+$B32,IF(Indtast!N21<>\"\",ROUND((60/$P32*Indtast!N$21),0)*$O$1+$B32,\"x\"))","v":"14:45:00"},{"$f":"IF(Indtast!O20<>\"\",ROUND((60/$P32*Indtast!O$20),0)*$O$1+$B32,IF(Indtast!O21<>\"\",ROUND((60/$P32*Indtast!O$21),0)*$O$1+$B32,\"x\"))","v":"15:08:00"},{"$f":"IF(Indtast!P20<>\"\",ROUND((60/$P32*Indtast!P$20),0)*$O$1+$B32,IF(Indtast!P21<>\"\",ROUND((60/$P32*Indtast!P$21),0)*$O$1+$B32,\"x\"))","v":"15:30:00"},{"$f":"IF(Indtast!Q20<>\"\",ROUND((60/$P32*Indtast!Q$20),0)*$O$1+$B32,IF(Indtast!Q21<>\"\",ROUND((60/$P32*Indtast!Q$21),0)*$O$1+$B32,\"x\"))","v":"x"},{"$f":"IF(Indtast!R20<>\"\",ROUND((60/$P32*Indtast!R$20),0)*$O$1+$B32,IF(Indtast!R21<>\"\",ROUND((60/$P32*Indtast!R$21),0)*$O$1+$B32,\"x\"))","v":"x"},{"$f":"IF(Indtast!S20<>\"\",ROUND((60/$P32*Indtast!S$20),0)*$O$1+$B32,IF(Indtast!S21<>\"\",ROUND((60/$P32*Indtast!S$21),0)*$O$1+$B32,\"x\"))","v":"x"},{"$f":"IF(Indtast!T20<>\"\",ROUND((60/$P32*Indtast!T$20),0)*$O$1+$B32,IF(Indtast!T21<>\"\",ROUND((60/$P32*Indtast!T$21),0)*$O$1+$B32,\"x\"))","v":"x"},null,{"$f":"Indtast!$E$20","v":40}]
[{"$f":"Indtast!A20&\" \"&Indtast!$D$2","v":"H40 Mel"},{"$f":"IF(Indtast!$B$20<>\"\",Indtast!$B$20,\"\")","v":"12:30:00"},{"$f":"IF(Indtast!I20<>\"\",ROUND((60/$P33*Indtast!I$20),0)*$O$1+$B33,IF(Indtast!I21<>\"\",ROUND((60/$P33*Indtast!I$21),0)*$O$1+$B33,\"x\"))","v":"12:52:00"},{"$f":"IF(Indtast!J20<>\"\",ROUND((60/$P33*Indtast!J$20),0)*$O$1+$B33,IF(Indtast!J21<>\"\",ROUND((60/$P33*Indtast!J$21),0)*$O$1+$B33,\"x\"))","v":"13:14:00"},{"$f":"IF(Indtast!K20<>\"\",ROUND((60/$P33*Indtast!K$20),0)*$O$1+$B33,IF(Indtast!K21<>\"\",ROUND((60/$P33*Indtast!K$21),0)*$O$1+$B33,\"x\"))","v":"13:36:00"},{"$f":"IF(Indtast!L20<>\"\",ROUND((60/$P33*Indtast!L$20),0)*$O$1+$B33,IF(Indtast!L21<>\"\",ROUND((60/$P33*Indtast!L$21),0)*$O$1+$B33,\"x\"))","v":"13:58:00"},{"$f":"IF(Indtast!M20<>\"\",ROUND((60/$P33*Indtast!M$20),0)*$O$1+$B33,IF(Indtast!M21<>\"\",ROUND((60/$P33*Indtast!M$21),0)*$O$1+$B33,\"x\"))","v":"14:20:00"},{"$f":"IF(Indtast!N20<>\"\",ROUND((60/$P33*Indtast!N$20),0)*$O$1+$B33,IF(Indtast!N21<>\"\",ROUND((60/$P33*Indtast!N$21),0)*$O$1+$B33,\"x\"))","v":"14:42:00"},{"$f":"IF(Indtast!O20<>\"\",ROUND((60/$P33*Indtast!O$20),0)*$O$1+$B33,IF(Indtast!O21<>\"\",ROUND((60/$P33*Indtast!O$21),0)*$O$1+$B33,\"x\"))","v":"15:04:00"},{"$f":"IF(Indtast!P20<>\"\",ROUND((60/$P33*Indtast!P$20),0)*$O$1+$B33,IF(Indtast!P21<>\"\",ROUND((60/$P33*Indtast!P$21),0)*$O$1+$B33,\"x\"))","v":"15:26:00"},{"$f":"IF(Indtast!Q20<>\"\",ROUND((60/$P33*Indtast!Q$20),0)*$O$1+$B33,IF(Indtast!Q21<>\"\",ROUND((60/$P33*Indtast!Q$21),0)*$O$1+$B33,\"x\"))","v":"x"},{"$f":"IF(Indtast!R20<>\"\",ROUND((60/$P33*Indtast!R$20),0)*$O$1+$B33,IF(Indtast!R21<>\"\",ROUND((60/$P33*Indtast!R$21),0)*$O$1+$B33,\"x\"))","v":"x"},{"$f":"IF(Indtast!S20<>\"\",ROUND((60/$P33*Indtast!S$20),0)*$O$1+$B33,IF(Indtast!S21<>\"\",ROUND((60/$P33*Indtast!S$21),0)*$O$1+$B33,\"x\"))","v":"x"},{"$f":"IF(Indtast!T20<>\"\",ROUND((60/$P33*Indtast!T$20),0)*$O$1+$B33,IF(Indtast!T21<>\"\",ROUND((60/$P33*Indtast!T$21),0)*$O$1+$B33,\"x\"))","v":"x"},null,{"$f":"Indtast!$D$20","v":41}]
[{"$f":"Indtast!A20&\" \"&Indtast!$C$2","v":"H40 Høj"},{"$f":"IF(Indtast!$B$20<>\"\",Indtast!$B$20,\"\")","v":"12:30:00"},{"$f":"IF(Indtast!I20<>\"\",ROUND((60/$P34*Indtast!I$20),0)*$O$1+$B34,IF(Indtast!I21<>\"\",ROUND((60/$P34*Indtast!I$21),0)*$O$1+$B34,\"x\"))","v":"12:51:00"},{"$f":"IF(Indtast!J20<>\"\",ROUND((60/$P34*Indtast!J$20),0)*$O$1+$B34,IF(Indtast!J21<>\"\",ROUND((60/$P34*Indtast!J$21),0)*$O$1+$B34,\"x\"))","v":"13:13:00"},{"$f":"IF(Indtast!K20<>\"\",ROUND((60/$P34*Indtast!K$20),0)*$O$1+$B34,IF(Indtast!K21<>\"\",ROUND((60/$P34*Indtast!K$21),0)*$O$1+$B34,\"x\"))","v":"13:34:00"},{"$f":"IF(Indtast!L20<>\"\",ROUND((60/$P34*Indtast!L$20),0)*$O$1+$B34,IF(Indtast!L21<>\"\",ROUND((60/$P34*Indtast!L$21),0)*$O$1+$B34,\"x\"))","v":"13:56:00"},{"$f":"IF(Indtast!M20<>\"\",ROUND((60/$P34*Indtast!M$20),0)*$O$1+$B34,IF(Indtast!M21<>\"\",ROUND((60/$P34*Indtast!M$21),0)*$O$1+$B34,\"x\"))","v":"14:17:00"},{"$f":"IF(Indtast!N20<>\"\",ROUND((60/$P34*Indtast!N$20),0)*$O$1+$B34,IF(Indtast!N21<>\"\",ROUND((60/$P34*Indtast!N$21),0)*$O$1+$B34,\"x\"))","v":"14:39:00"},{"$f":"IF(Indtast!O20<>\"\",ROUND((60/$P34*Indtast!O$20),0)*$O$1+$B34,IF(Indtast!O21<>\"\",ROUND((60/$P34*Indtast!O$21),0)*$O$1+$B34,\"x\"))","v":"15:00:00"},{"$f":"IF(Indtast!P20<>\"\",ROUND((60/$P34*Indtast!P$20),0)*$O$1+$B34,IF(Indtast!P21<>\"\",ROUND((60/$P34*Indtast!P$21),0)*$O$1+$B34,\"x\"))","v":"15:21:00"},{"$f":"IF(Indtast!Q20<>\"\",ROUND((60/$P34*Indtast!Q$20),0)*$O$1+$B34,IF(Indtast!Q21<>\"\",ROUND((60/$P34*Indtast!Q$21),0)*$O$1+$B34,\"x\"))","v":"x"},{"$f":"IF(Indtast!R20<>\"\",ROUND((60/$P34*Indtast!R$20),0)*$O$1+$B34,IF(Indtast!R21<>\"\",ROUND((60/$P34*Indtast!R$21),0)*$O$1+$B34,\"x\"))","v":"x"},{"$f":"IF(Indtast!S20<>\"\",ROUND((60/$P34*Indtast!S$20),0)*$O$1+$B34,IF(Indtast!S21<>\"\",ROUND((60/$P34*Indtast!S$21),0)*$O$1+$B34,\"x\"))","v":"x"},{"$f":"IF(Indtast!T20<>\"\",ROUND((60/$P34*Indtast!T$20),0)*$O$1+$B34,IF(Indtast!T21<>\"\",ROUND((60/$P34*Indtast!T$21),0)*$O$1+$B34,\"x\"))","v":"x"},null,{"$f":"Indtast!$C$20","v":42}]
[{"$f":"Indtast!$A22&\" \"&Indtast!$E$2","v":"H50 Lav"},{"$f":"IF(Indtast!$B$22<>\"\",Indtast!$B$22,\"\")","v":"12:32:00"},{"$f":"IF(Indtast!I22<>\"\",ROUND((60/$P35*Indtast!I$22),0)*$O$1+$B35,IF(Indtast!I23<>\"\",ROUND((60/$P35*Indtast!I$23),0)*$O$1+$B35,\"x\"))","v":"12:56:00"},{"$f":"IF(Indtast!J22<>\"\",ROUND((60/$P35*Indtast!J$22),0)*$O$1+$B35,IF(Indtast!J23<>\"\",ROUND((60/$P35*Indtast!J$23),0)*$O$1+$B35,\"x\"))","v":"13:21:00"},{"$f":"IF(Indtast!K22<>\"\",ROUND((60/$P35*Indtast!K$22),0)*$O$1+$B35,IF(Indtast!K23<>\"\",ROUND((60/$P35*Indtast!K$23),0)*$O$1+$B35,\"x\"))","v":"13:45:00"},{"$f":"IF(Indtast!L22<>\"\",ROUND((60/$P35*Indtast!L$22),0)*$O$1+$B35,IF(Indtast!L23<>\"\",ROUND((60/$P35*Indtast!L$23),0)*$O$1+$B35,\"x\"))","v":"14:09:00"},{"$f":"IF(Indtast!M22<>\"\",ROUND((60/$P35*Indtast!M$22),0)*$O$1+$B35,IF(Indtast!M23<>\"\",ROUND((60/$P35*Indtast!M$23),0)*$O$1+$B35,\"x\"))","v":"14:34:00"},{"$f":"IF(Indtast!N22<>\"\",ROUND((60/$P35*Indtast!N$22),0)*$O$1+$B35,IF(Indtast!N23<>\"\",ROUND((60/$P35*Indtast!N$23),0)*$O$1+$B35,\"x\"))","v":"14:58:00"},{"$f":"IF(Indtast!O22<>\"\",ROUND((60/$P35*Indtast!O$22),0)*$O$1+$B35,IF(Indtast!O23<>\"\",ROUND((60/$P35*Indtast!O$23),0)*$O$1+$B35,\"x\"))","v":"15:22:00"},{"$f":"IF(Indtast!P22<>\"\",ROUND((60/$P35*Indtast!P$22),0)*$O$1+$B35,IF(Indtast!P23<>\"\",ROUND((60/$P35*Indtast!P$23),0)*$O$1+$B35,\"x\"))","v":"15:47:00"},{"$f":"IF(Indtast!Q22<>\"\",ROUND((60/$P35*Indtast!Q$22),0)*$O$1+$B35,IF(Indtast!Q23<>\"\",ROUND((60/$P35*Indtast!Q$23),0)*$O$1+$B35,\"x\"))","v":"x"},{"$f":"IF(Indtast!R22<>\"\",ROUND((60/$P35*Indtast!R$22),0)*$O$1+$B35,IF(Indtast!R23<>\"\",ROUND((60/$P35*Indtast!R$23),0)*$O$1+$B35,\"x\"))","v":"x"},{"$f":"IF(Indtast!S22<>\"\",ROUND((60/$P35*Indtast!S$22),0)*$O$1+$B35,IF(Indtast!S23<>\"\",ROUND((60/$P35*Indtast!S$23),0)*$O$1+$B35,\"x\"))","v":"x"},{"$f":"IF(Indtast!T22<>\"\",ROUND((60/$P35*Indtast!T$22),0)*$O$1+$B35,IF(Indtast!T23<>\"\",ROUND((60/$P35*Indtast!T$23),0)*$O$1+$B35,\"x\"))","v":"x"},null,{"$f":"Indtast!$E$22","v":37}]
[{"$f":"Indtast!A22&\" \"&Indtast!$D$2","v":"H50 Mel"},{"$f":"IF(Indtast!$B$22<>\"\",Indtast!$B$22,\"\")","v":"12:32:00"},{"$f":"IF(Indtast!I22<>\"\",ROUND((60/$P36*Indtast!I$22),0)*$O$1+$B36,IF(Indtast!I23<>\"\",ROUND((60/$P36*Indtast!I$23),0)*$O$1+$B36,\"x\"))","v":"12:56:00"},{"$f":"IF(Indtast!J22<>\"\",ROUND((60/$P36*Indtast!J$22),0)*$O$1+$B36,IF(Indtast!J23<>\"\",ROUND((60/$P36*Indtast!J$23),0)*$O$1+$B36,\"x\"))","v":"13:19:00"},{"$f":"IF(Indtast!K22<>\"\",ROUND((60/$P36*Indtast!K$22),0)*$O$1+$B36,IF(Indtast!K23<>\"\",ROUND((60/$P36*Indtast!K$23),0)*$O$1+$B36,\"x\"))","v":"13:43:00"},{"$f":"IF(Indtast!L22<>\"\",ROUND((60/$P36*Indtast!L$22),0)*$O$1+$B36,IF(Indtast!L23<>\"\",ROUND((60/$P36*Indtast!L$23),0)*$O$1+$B36,\"x\"))","v":"14:07:00"},{"$f":"IF(Indtast!M22<>\"\",ROUND((60/$P36*Indtast!M$22),0)*$O$1+$B36,IF(Indtast!M23<>\"\",ROUND((60/$P36*Indtast!M$23),0)*$O$1+$B36,\"x\"))","v":"14:30:00"},{"$f":"IF(Indtast!N22<>\"\",ROUND((60/$P36*Indtast!N$22),0)*$O$1+$B36,IF(Indtast!N23<>\"\",ROUND((60/$P36*Indtast!N$23),0)*$O$1+$B36,\"x\"))","v":"14:54:00"},{"$f":"IF(Indtast!O22<>\"\",ROUND((60/$P36*Indtast!O$22),0)*$O$1+$B36,IF(Indtast!O23<>\"\",ROUND((60/$P36*Indtast!O$23),0)*$O$1+$B36,\"x\"))","v":"15:18:00"},{"$f":"IF(Indtast!P22<>\"\",ROUND((60/$P36*Indtast!P$22),0)*$O$1+$B36,IF(Indtast!P23<>\"\",ROUND((60/$P36*Indtast!P$23),0)*$O$1+$B36,\"x\"))","v":"15:41:00"},{"$f":"IF(Indtast!Q22<>\"\",ROUND((60/$P36*Indtast!Q$22),0)*$O$1+$B36,IF(Indtast!Q23<>\"\",ROUND((60/$P36*Indtast!Q$23),0)*$O$1+$B36,\"x\"))","v":"x"},{"$f":"IF(Indtast!R22<>\"\",ROUND((60/$P36*Indtast!R$22),0)*$O$1+$B36,IF(Indtast!R23<>\"\",ROUND((60/$P36*Indtast!R$23),0)*$O$1+$B36,\"x\"))","v":"x"},{"$f":"IF(Indtast!S22<>\"\",ROUND((60/$P36*Indtast!S$22),0)*$O$1+$B36,IF(Indtast!S23<>\"\",ROUND((60/$P36*Indtast!S$23),0)*$O$1+$B36,\"x\"))","v":"x"},{"$f":"IF(Indtast!T22<>\"\",ROUND((60/$P36*Indtast!T$22),0)*$O$1+$B36,IF(Indtast!T23<>\"\",ROUND((60/$P36*Indtast!T$23),0)*$O$1+$B36,\"x\"))","v":"x"},null,{"$f":"Indtast!$D$22","v":38}]
[{"$f":"Indtast!A22&\" \"&Indtast!$C$2","v":"H50 Høj"},{"$f":"IF(Indtast!$B$22<>\"\",Indtast!$B$22,\"\")","v":"12:32:00"},{"$f":"IF(Indtast!I22<>\"\",ROUND((60/$P37*Indtast!I$22),0)*$O$1+$B37,IF(Indtast!I23<>\"\",ROUND((60/$P37*Indtast!I$23),0)*$O$1+$B37,\"x\"))","v":"12:55:00"},{"$f":"IF(Indtast!J22<>\"\",ROUND((60/$P37*Indtast!J$22),0)*$O$1+$B37,IF(Indtast!J23<>\"\",ROUND((60/$P37*Indtast!J$23),0)*$O$1+$B37,\"x\"))","v":"13:18:00"},{"$f":"IF(Indtast!K22<>\"\",ROUND((60/$P37*Indtast!K$22),0)*$O$1+$B37,IF(Indtast!K23<>\"\",ROUND((60/$P37*Indtast!K$23),0)*$O$1+$B37,\"x\"))","v":"13:41:00"},{"$f":"IF(Indtast!L22<>\"\",ROUND((60/$P37*Indtast!L$22),0)*$O$1+$B37,IF(Indtast!L23<>\"\",ROUND((60/$P37*Indtast!L$23),0)*$O$1+$B37,\"x\"))","v":"14:04:00"},{"$f":"IF(Indtast!M22<>\"\",ROUND((60/$P37*Indtast!M$22),0)*$O$1+$B37,IF(Indtast!M23<>\"\",ROUND((60/$P37*Indtast!M$23),0)*$O$1+$B37,\"x\"))","v":"14:27:00"},{"$f":"IF(Indtast!N22<>\"\",ROUND((60/$P37*Indtast!N$22),0)*$O$1+$B37,IF(Indtast!N23<>\"\",ROUND((60/$P37*Indtast!N$23),0)*$O$1+$B37,\"x\"))","v":"14:50:00"},{"$f":"IF(Indtast!O22<>\"\",ROUND((60/$P37*Indtast!O$22),0)*$O$1+$B37,IF(Indtast!O23<>\"\",ROUND((60/$P37*Indtast!O$23),0)*$O$1+$B37,\"x\"))","v":"15:14:00"},{"$f":"IF(Indtast!P22<>\"\",ROUND((60/$P37*Indtast!P$22),0)*$O$1+$B37,IF(Indtast!P23<>\"\",ROUND((60/$P37*Indtast!P$23),0)*$O$1+$B37,\"x\"))","v":"15:37:00"},{"$f":"IF(Indtast!Q22<>\"\",ROUND((60/$P37*Indtast!Q$22),0)*$O$1+$B37,IF(Indtast!Q23<>\"\",ROUND((60/$P37*Indtast!Q$23),0)*$O$1+$B37,\"x\"))","v":"x"},{"$f":"IF(Indtast!R22<>\"\",ROUND((60/$P37*Indtast!R$22),0)*$O$1+$B37,IF(Indtast!R23<>\"\",ROUND((60/$P37*Indtast!R$23),0)*$O$1+$B37,\"x\"))","v":"x"},{"$f":"IF(Indtast!S22<>\"\",ROUND((60/$P37*Indtast!S$22),0)*$O$1+$B37,IF(Indtast!S23<>\"\",ROUND((60/$P37*Indtast!S$23),0)*$O$1+$B37,\"x\"))","v":"x"},{"$f":"IF(Indtast!T22<>\"\",ROUND((60/$P37*Indtast!T$22),0)*$O$1+$B37,IF(Indtast!T23<>\"\",ROUND((60/$P37*Indtast!T$23),0)*$O$1+$B37,\"x\"))","v":"x"},null,{"$f":"Indtast!$C$22","v":39}]
[{"$f":"Indtast!A24&\" \"&Indtast!$E$2","v":"H60 Lav"},{"$f":"IF(Indtast!$B$24<>\"\",Indtast!$B$24,\"\")","v":"12:34:00"},{"$f":"IF(Indtast!I24<>\"\",ROUND((60/$P38*Indtast!I$24),0)*$O$1+$B38,IF(Indtast!I25<>\"\",ROUND((60/$P38*Indtast!I$25),0)*$O$1+$B38,\"x\"))","v":"12:59:00"},{"$f":"IF(Indtast!J24<>\"\",ROUND((60/$P38*Indtast!J$24),0)*$O$1+$B38,IF(Indtast!J25<>\"\",ROUND((60/$P38*Indtast!J$25),0)*$O$1+$B38,\"x\"))","v":"13:24:00"},{"$f":"IF(Indtast!K24<>\"\",ROUND((60/$P38*Indtast!K$24),0)*$O$1+$B38,IF(Indtast!K25<>\"\",ROUND((60/$P38*Indtast!K$25),0)*$O$1+$B38,\"x\"))","v":"13:49:00"},{"$f":"IF(Indtast!L24<>\"\",ROUND((60/$P38*Indtast!L$24),0)*$O$1+$B38,IF(Indtast!L25<>\"\",ROUND((60/$P38*Indtast!L$25),0)*$O$1+$B38,\"x\"))","v":"14:14:00"},{"$f":"IF(Indtast!M24<>\"\",ROUND((60/$P38*Indtast!M$24),0)*$O$1+$B38,IF(Indtast!M25<>\"\",ROUND((60/$P38*Indtast!M$25),0)*$O$1+$B38,\"x\"))","v":"14:39:00"},{"$f":"IF(Indtast!N24<>\"\",ROUND((60/$P38*Indtast!N$24),0)*$O$1+$B38,IF(Indtast!N25<>\"\",ROUND((60/$P38*Indtast!N$25),0)*$O$1+$B38,\"x\"))","v":"15:04:00"},{"$f":"IF(Indtast!O24<>\"\",ROUND((60/$P38*Indtast!O$24),0)*$O$1+$B38,IF(Indtast!O25<>\"\",ROUND((60/$P38*Indtast!O$25),0)*$O$1+$B38,\"x\"))","v":"15:29:00"},{"$f":"IF(Indtast!P24<>\"\",ROUND((60/$P38*Indtast!P$24),0)*$O$1+$B38,IF(Indtast!P25<>\"\",ROUND((60/$P38*Indtast!P$25),0)*$O$1+$B38,\"x\"))","v":"x"},{"$f":"IF(Indtast!Q24<>\"\",ROUND((60/$P38*Indtast!Q$24),0)*$O$1+$B38,IF(Indtast!Q25<>\"\",ROUND((60/$P38*Indtast!Q$25),0)*$O$1+$B38,\"x\"))","v":"x"},{"$f":"IF(Indtast!R24<>\"\",ROUND((60/$P38*Indtast!R$24),0)*$O$1+$B38,IF(Indtast!R25<>\"\",ROUND((60/$P38*Indtast!R$25),0)*$O$1+$B38,\"x\"))","v":"x"},{"$f":"IF(Indtast!S24<>\"\",ROUND((60/$P38*Indtast!S$24),0)*$O$1+$B38,IF(Indtast!S25<>\"\",ROUND((60/$P38*Indtast!S$25),0)*$O$1+$B38,\"x\"))","v":"x"},{"$f":"IF(Indtast!T24<>\"\",ROUND((60/$P38*Indtast!T$24),0)*$O$1+$B38,IF(Indtast!T25<>\"\",ROUND((60/$P38*Indtast!T$25),0)*$O$1+$B38,\"x\"))","v":"x"},null,{"$f":"Indtast!$E$24","v":36}]
[{"$f":"Indtast!$A24&\" \"&Indtast!$D$2","v":"H60 Mel"},{"$f":"IF(Indtast!$B$24<>\"\",Indtast!$B$24,\"\")","v":"12:34:00"},{"$f":"IF(Indtast!I24<>\"\",ROUND((60/$P39*Indtast!I$24),0)*$O$1+$B39,IF(Indtast!I25<>\"\",ROUND((60/$P39*Indtast!I$25),0)*$O$1+$B39,\"x\"))","v":"12:58:00"},{"$f":"IF(Indtast!J24<>\"\",ROUND((60/$P39*Indtast!J$24),0)*$O$1+$B39,IF(Indtast!J25<>\"\",ROUND((60/$P39*Indtast!J$25),0)*$O$1+$B39,\"x\"))","v":"13:23:00"},{"$f":"IF(Indtast!K24<>\"\",ROUND((60/$P39*Indtast!K$24),0)*$O$1+$B39,IF(Indtast!K25<>\"\",ROUND((60/$P39*Indtast!K$25),0)*$O$1+$B39,\"x\"))","v":"13:47:00"},{"$f":"IF(Indtast!L24<>\"\",ROUND((60/$P39*Indtast!L$24),0)*$O$1+$B39,IF(Indtast!L25<>\"\",ROUND((60/$P39*Indtast!L$25),0)*$O$1+$B39,\"x\"))","v":"14:11:00"},{"$f":"IF(Indtast!M24<>\"\",ROUND((60/$P39*Indtast!M$24),0)*$O$1+$B39,IF(Indtast!M25<>\"\",ROUND((60/$P39*Indtast!M$25),0)*$O$1+$B39,\"x\"))","v":"14:36:00"},{"$f":"IF(Indtast!N24<>\"\",ROUND((60/$P39*Indtast!N$24),0)*$O$1+$B39,IF(Indtast!N25<>\"\",ROUND((60/$P39*Indtast!N$25),0)*$O$1+$B39,\"x\"))","v":"15:00:00"},{"$f":"IF(Indtast!O24<>\"\",ROUND((60/$P39*Indtast!O$24),0)*$O$1+$B39,IF(Indtast!O25<>\"\",ROUND((60/$P39*Indtast!O$25),0)*$O$1+$B39,\"x\"))","v":"15:24:00"},{"$f":"IF(Indtast!P24<>\"\",ROUND((60/$P39*Indtast!P$24),0)*$O$1+$B39,IF(Indtast!P25<>\"\",ROUND((60/$P39*Indtast!P$25),0)*$O$1+$B39,\"x\"))","v":"x"},{"$f":"IF(Indtast!Q24<>\"\",ROUND((60/$P39*Indtast!Q$24),0)*$O$1+$B39,IF(Indtast!Q25<>\"\",ROUND((60/$P39*Indtast!Q$25),0)*$O$1+$B39,\"x\"))","v":"x"},{"$f":"IF(Indtast!R24<>\"\",ROUND((60/$P39*Indtast!R$24),0)*$O$1+$B39,IF(Indtast!R25<>\"\",ROUND((60/$P39*Indtast!R$25),0)*$O$1+$B39,\"x\"))","v":"x"},{"$f":"IF(Indtast!S24<>\"\",ROUND((60/$P39*Indtast!S$24),0)*$O$1+$B39,IF(Indtast!S25<>\"\",ROUND((60/$P39*Indtast!S$25),0)*$O$1+$B39,\"x\"))","v":"x"},{"$f":"IF(Indtast!T24<>\"\",ROUND((60/$P39*Indtast!T$24),0)*$O$1+$B39,IF(Indtast!T25<>\"\",ROUND((60/$P39*Indtast!T$25),0)*$O$1+$B39,\"x\"))","v":"x"},null,{"$f":"Indtast!$D$24","v":37}]
[{"$f":"Indtast!A24&\" \"&Indtast!$C$2","v":"H60 Høj"},{"$f":"IF(Indtast!$B$24<>\"\",Indtast!$B$24,\"\")","v":"12:34:00"},{"$f":"IF(Indtast!I24<>\"\",ROUND((60/$P40*Indtast!I$24),0)*$O$1+$B40,IF(Indtast!I25<>\"\",ROUND((60/$P40*Indtast!I$25),0)*$O$1+$B40,\"x\"))","v":"12:58:00"},{"$f":"IF(Indtast!J24<>\"\",ROUND((60/$P40*Indtast!J$24),0)*$O$1+$B40,IF(Indtast!J25<>\"\",ROUND((60/$P40*Indtast!J$25),0)*$O$1+$B40,\"x\"))","v":"13:21:00"},{"$f":"IF(Indtast!K24<>\"\",ROUND((60/$P40*Indtast!K$24),0)*$O$1+$B40,IF(Indtast!K25<>\"\",ROUND((60/$P40*Indtast!K$25),0)*$O$1+$B40,\"x\"))","v":"13:45:00"},{"$f":"IF(Indtast!L24<>\"\",ROUND((60/$P40*Indtast!L$24),0)*$O$1+$B40,IF(Indtast!L25<>\"\",ROUND((60/$P40*Indtast!L$25),0)*$O$1+$B40,\"x\"))","v":"14:09:00"},{"$f":"IF(Indtast!M24<>\"\",ROUND((60/$P40*Indtast!M$24),0)*$O$1+$B40,IF(Indtast!M25<>\"\",ROUND((60/$P40*Indtast!M$25),0)*$O$1+$B40,\"x\"))","v":"14:32:00"},{"$f":"IF(Indtast!N24<>\"\",ROUND((60/$P40*Indtast!N$24),0)*$O$1+$B40,IF(Indtast!N25<>\"\",ROUND((60/$P40*Indtast!N$25),0)*$O$1+$B40,\"x\"))","v":"14:56:00"},{"$f":"IF(Indtast!O24<>\"\",ROUND((60/$P40*Indtast!O$24),0)*$O$1+$B40,IF(Indtast!O25<>\"\",ROUND((60/$P40*Indtast!O$25),0)*$O$1+$B40,\"x\"))","v":"15:20:00"},{"$f":"IF(Indtast!P24<>\"\",ROUND((60/$P40*Indtast!P$24),0)*$O$1+$B40,IF(Indtast!P25<>\"\",ROUND((60/$P40*Indtast!P$25),0)*$O$1+$B40,\"x\"))","v":"x"},{"$f":"IF(Indtast!Q24<>\"\",ROUND((60/$P40*Indtast!Q$24),0)*$O$1+$B40,IF(Indtast!Q25<>\"\",ROUND((60/$P40*Indtast!Q$25),0)*$O$1+$B40,\"x\"))","v":"x"},{"$f":"IF(Indtast!R24<>\"\",ROUND((60/$P40*Indtast!R$24),0)*$O$1+$B40,IF(Indtast!R25<>\"\",ROUND((60/$P40*Indtast!R$25),0)*$O$1+$B40,\"x\"))","v":"x"},{"$f":"IF(Indtast!S24<>\"\",ROUND((60/$P40*Indtast!S$24),0)*$O$1+$B40,IF(Indtast!S25<>\"\",ROUND((60/$P40*Indtast!S$25),0)*$O$1+$B40,\"x\"))","v":"x"},{"$f":"IF(Indtast!T24<>\"\",ROUND((60/$P40*Indtast!T$24),0)*$O$1+$B40,IF(Indtast!T25<>\"\",ROUND((60/$P40*Indtast!T$25),0)*$O$1+$B40,\"x\"))","v":"x"},null,{"$f":"Indtast!$C$24","v":38}]
[{"$f":"Indtast!$A26&\" \"&Indtast!$E$2","v":"H70 Lav"},{"$f":"IF(Indtast!$B$26<>\"\",Indtast!$B$26,\"\")","v":"12:36:00"},{"$f":"IF(Indtast!I26<>\"\",ROUND((60/$P41*Indtast!I$26),0)*$O$1+$B41,IF(Indtast!I27<>\"\",ROUND((60/$P41*Indtast!I$27),0)*$O$1+$B41,\"x\"))","v":"13:02:00"},{"$f":"IF(Indtast!J26<>\"\",ROUND((60/$P41*Indtast!J$26),0)*$O$1+$B41,IF(Indtast!J27<>\"\",ROUND((60/$P41*Indtast!J$27),0)*$O$1+$B41,\"x\"))","v":"13:27:00"},{"$f":"IF(Indtast!K26<>\"\",ROUND((60/$P41*Indtast!K$26),0)*$O$1+$B41,IF(Indtast!K27<>\"\",ROUND((60/$P41*Indtast!K$27),0)*$O$1+$B41,\"x\"))","v":"13:53:00"},{"$f":"IF(Indtast!L26<>\"\",ROUND((60/$P41*Indtast!L$26),0)*$O$1+$B41,IF(Indtast!L27<>\"\",ROUND((60/$P41*Indtast!L$27),0)*$O$1+$B41,\"x\"))","v":"14:19:00"},{"$f":"IF(Indtast!M26<>\"\",ROUND((60/$P41*Indtast!M$26),0)*$O$1+$B41,IF(Indtast!M27<>\"\",ROUND((60/$P41*Indtast!M$27),0)*$O$1+$B41,\"x\"))","v":"14:45:00"},{"$f":"IF(Indtast!N26<>\"\",ROUND((60/$P41*Indtast!N$26),0)*$O$1+$B41,IF(Indtast!N27<>\"\",ROUND((60/$P41*Indtast!N$27),0)*$O$1+$B41,\"x\"))","v":"15:10:00"},{"$f":"IF(Indtast!O26<>\"\",ROUND((60/$P41*Indtast!O$26),0)*$O$1+$B41,IF(Indtast!O27<>\"\",ROUND((60/$P41*Indtast!O$27),0)*$O$1+$B41,\"x\"))","v":"15:36:00"},{"$f":"IF(Indtast!P26<>\"\",ROUND((60/$P41*Indtast!P$26),0)*$O$1+$B41,IF(Indtast!P27<>\"\",ROUND((60/$P41*Indtast!P$27),0)*$O$1+$B41,\"x\"))","v":"x"},{"$f":"IF(Indtast!Q26<>\"\",ROUND((60/$P41*Indtast!Q$26),0)*$O$1+$B41,IF(Indtast!Q27<>\"\",ROUND((60/$P41*Indtast!Q$27),0)*$O$1+$B41,\"x\"))","v":"x"},{"$f":"IF(Indtast!R26<>\"\",ROUND((60/$P41*Indtast!R$26),0)*$O$1+$B41,IF(Indtast!R27<>\"\",ROUND((60/$P41*Indtast!R$27),0)*$O$1+$B41,\"x\"))","v":"x"},{"$f":"IF(Indtast!S26<>\"\",ROUND((60/$P41*Indtast!S$26),0)*$O$1+$B41,IF(Indtast!S27<>\"\",ROUND((60/$P41*Indtast!S$27),0)*$O$1+$B41,\"x\"))","v":"x"},{"$f":"IF(Indtast!T26<>\"\",ROUND((60/$P41*Indtast!T$26),0)*$O$1+$B41,IF(Indtast!T27<>\"\",ROUND((60/$P41*Indtast!T$27),0)*$O$1+$B41,\"x\"))","v":"x"},null,{"$f":"Indtast!$E$26","v":35}]
[{"$f":"Indtast!A26&\" \"&Indtast!$D$2","v":"H70 Mel"},{"$f":"IF(Indtast!$B$26<>\"\",Indtast!$B$26,\"\")","v":"12:36:00"},{"$f":"IF(Indtast!I26<>\"\",ROUND((60/$P42*Indtast!I$26),0)*$O$1+$B42,IF(Indtast!I27<>\"\",ROUND((60/$P42*Indtast!I$27),0)*$O$1+$B42,\"x\"))","v":"13:01:00"},{"$f":"IF(Indtast!J26<>\"\",ROUND((60/$P42*Indtast!J$26),0)*$O$1+$B42,IF(Indtast!J27<>\"\",ROUND((60/$P42*Indtast!J$27),0)*$O$1+$B42,\"x\"))","v":"13:26:00"},{"$f":"IF(Indtast!K26<>\"\",ROUND((60/$P42*Indtast!K$26),0)*$O$1+$B42,IF(Indtast!K27<>\"\",ROUND((60/$P42*Indtast!K$27),0)*$O$1+$B42,\"x\"))","v":"13:51:00"},{"$f":"IF(Indtast!L26<>\"\",ROUND((60/$P42*Indtast!L$26),0)*$O$1+$B42,IF(Indtast!L27<>\"\",ROUND((60/$P42*Indtast!L$27),0)*$O$1+$B42,\"x\"))","v":"14:16:00"},{"$f":"IF(Indtast!M26<>\"\",ROUND((60/$P42*Indtast!M$26),0)*$O$1+$B42,IF(Indtast!M27<>\"\",ROUND((60/$P42*Indtast!M$27),0)*$O$1+$B42,\"x\"))","v":"14:41:00"},{"$f":"IF(Indtast!N26<>\"\",ROUND((60/$P42*Indtast!N$26),0)*$O$1+$B42,IF(Indtast!N27<>\"\",ROUND((60/$P42*Indtast!N$27),0)*$O$1+$B42,\"x\"))","v":"15:06:00"},{"$f":"IF(Indtast!O26<>\"\",ROUND((60/$P42*Indtast!O$26),0)*$O$1+$B42,IF(Indtast!O27<>\"\",ROUND((60/$P42*Indtast!O$27),0)*$O$1+$B42,\"x\"))","v":"15:31:00"},{"$f":"IF(Indtast!P26<>\"\",ROUND((60/$P42*Indtast!P$26),0)*$O$1+$B42,IF(Indtast!P27<>\"\",ROUND((60/$P42*Indtast!P$27),0)*$O$1+$B42,\"x\"))","v":"x"},{"$f":"IF(Indtast!Q26<>\"\",ROUND((60/$P42*Indtast!Q$26),0)*$O$1+$B42,IF(Indtast!Q27<>\"\",ROUND((60/$P42*Indtast!Q$27),0)*$O$1+$B42,\"x\"))","v":"x"},{"$f":"IF(Indtast!R26<>\"\",ROUND((60/$P42*Indtast!R$26),0)*$O$1+$B42,IF(Indtast!R27<>\"\",ROUND((60/$P42*Indtast!R$27),0)*$O$1+$B42,\"x\"))","v":"x"},{"$f":"IF(Indtast!S26<>\"\",ROUND((60/$P42*Indtast!S$26),0)*$O$1+$B42,IF(Indtast!S27<>\"\",ROUND((60/$P42*Indtast!S$27),0)*$O$1+$B42,\"x\"))","v":"x"},{"$f":"IF(Indtast!T26<>\"\",ROUND((60/$P42*Indtast!T$26),0)*$O$1+$B42,IF(Indtast!T27<>\"\",ROUND((60/$P42*Indtast!T$27),0)*$O$1+$B42,\"x\"))","v":"x"},null,{"$f":"Indtast!$D$26","v":36}]
[{"$f":"Indtast!A26&\" \"&Indtast!$C$2","v":"H70 Høj"},{"$f":"IF(Indtast!$B$26<>\"\",Indtast!$B$26,\"\")","v":"12:36:00"},{"$f":"IF(Indtast!I26<>\"\",ROUND((60/$P43*Indtast!I$26),0)*$O$1+$B43,IF(Indtast!I27<>\"\",ROUND((60/$P43*Indtast!I$27),0)*$O$1+$B43,\"x\"))","v":"13:00:00"},{"$f":"IF(Indtast!J26<>\"\",ROUND((60/$P43*Indtast!J$26),0)*$O$1+$B43,IF(Indtast!J27<>\"\",ROUND((60/$P43*Indtast!J$27),0)*$O$1+$B43,\"x\"))","v":"13:25:00"},{"$f":"IF(Indtast!K26<>\"\",ROUND((60/$P43*Indtast!K$26),0)*$O$1+$B43,IF(Indtast!K27<>\"\",ROUND((60/$P43*Indtast!K$27),0)*$O$1+$B43,\"x\"))","v":"13:49:00"},{"$f":"IF(Indtast!L26<>\"\",ROUND((60/$P43*Indtast!L$26),0)*$O$1+$B43,IF(Indtast!L27<>\"\",ROUND((60/$P43*Indtast!L$27),0)*$O$1+$B43,\"x\"))","v":"14:13:00"},{"$f":"IF(Indtast!M26<>\"\",ROUND((60/$P43*Indtast!M$26),0)*$O$1+$B43,IF(Indtast!M27<>\"\",ROUND((60/$P43*Indtast!M$27),0)*$O$1+$B43,\"x\"))","v":"14:38:00"},{"$f":"IF(Indtast!N26<>\"\",ROUND((60/$P43*Indtast!N$26),0)*$O$1+$B43,IF(Indtast!N27<>\"\",ROUND((60/$P43*Indtast!N$27),0)*$O$1+$B43,\"x\"))","v":"15:02:00"},{"$f":"IF(Indtast!O26<>\"\",ROUND((60/$P43*Indtast!O$26),0)*$O$1+$B43,IF(Indtast!O27<>\"\",ROUND((60/$P43*Indtast!O$27),0)*$O$1+$B43,\"x\"))","v":"15:26:00"},{"$f":"IF(Indtast!P26<>\"\",ROUND((60/$P43*Indtast!P$26),0)*$O$1+$B43,IF(Indtast!P27<>\"\",ROUND((60/$P43*Indtast!P$27),0)*$O$1+$B43,\"x\"))","v":"x"},{"$f":"IF(Indtast!Q26<>\"\",ROUND((60/$P43*Indtast!Q$26),0)*$O$1+$B43,IF(Indtast!Q27<>\"\",ROUND((60/$P43*Indtast!Q$27),0)*$O$1+$B43,\"x\"))","v":"x"},{"$f":"IF(Indtast!R26<>\"\",ROUND((60/$P43*Indtast!R$26),0)*$O$1+$B43,IF(Indtast!R27<>\"\",ROUND((60/$P43*Indtast!R$27),0)*$O$1+$B43,\"x\"))","v":"x"},{"$f":"IF(Indtast!S26<>\"\",ROUND((60/$P43*Indtast!S$26),0)*$O$1+$B43,IF(Indtast!S27<>\"\",ROUND((60/$P43*Indtast!S$27),0)*$O$1+$B43,\"x\"))","v":"x"},{"$f":"IF(Indtast!T26<>\"\",ROUND((60/$P43*Indtast!T$26),0)*$O$1+$B43,IF(Indtast!T27<>\"\",ROUND((60/$P43*Indtast!T$27),0)*$O$1+$B43,\"x\"))","v":"x"},null,{"$f":"Indtast!$C$26","v":37}]
[{"$f":"Indtast!$A32&\" \"&Indtast!$E$2","v":"A Lav"},{"$f":"IF(Indtast!$B$32<>\"\",Indtast!$B$32,\"\")","v":"15:15:00"},{"$f":"IF(Indtast!I32<>\"\",ROUND((60/$P44*Indtast!I$32),0)*$O$1+$B44,IF(Indtast!I33<>\"\",ROUND((60/$P44*Indtast!I$33),0)*$O$1+$B44,\"x\"))","v":"15:35:00"},{"$f":"IF(Indtast!J32<>\"\",ROUND((60/$P44*Indtast!J$32),0)*$O$1+$B44,IF(Indtast!J33<>\"\",ROUND((60/$P44*Indtast!J$33),0)*$O$1+$B44,\"x\"))","v":"15:56:00"},{"$f":"IF(Indtast!K32<>\"\",ROUND((60/$P44*Indtast!K$32),0)*$O$1+$B44,IF(Indtast!K33<>\"\",ROUND((60/$P44*Indtast!K$33),0)*$O$1+$B44,\"x\"))","v":"16:16:00"},{"$f":"IF(Indtast!L32<>\"\",ROUND((60/$P44*Indtast!L$32),0)*$O$1+$B44,IF(Indtast!L33<>\"\",ROUND((60/$P44*Indtast!L$33),0)*$O$1+$B44,\"x\"))","v":"16:37:00"},{"$f":"IF(Indtast!M32<>\"\",ROUND((60/$P44*Indtast!M$32),0)*$O$1+$B44,IF(Indtast!M33<>\"\",ROUND((60/$P44*Indtast!M$33),0)*$O$1+$B44,\"x\"))","v":"16:57:00"},{"$f":"IF(Indtast!N32<>\"\",ROUND((60/$P44*Indtast!N$32),0)*$O$1+$B44,IF(Indtast!N33<>\"\",ROUND((60/$P44*Indtast!N$33),0)*$O$1+$B44,\"x\"))","v":"17:18:00"},{"$f":"IF(Indtast!O32<>\"\",ROUND((60/$P44*Indtast!O$32),0)*$O$1+$B44,IF(Indtast!O33<>\"\",ROUND((60/$P44*Indtast!O$33),0)*$O$1+$B44,\"x\"))","v":"17:38:00"},{"$f":"IF(Indtast!P32<>\"\",ROUND((60/$P44*Indtast!P$32),0)*$O$1+$B44,IF(Indtast!P33<>\"\",ROUND((60/$P44*Indtast!P$33),0)*$O$1+$B44,\"x\"))","v":"17:59:00"},{"$f":"IF(Indtast!Q32<>\"\",ROUND((60/$P44*Indtast!Q$32),0)*$O$1+$B44,IF(Indtast!Q33<>\"\",ROUND((60/$P44*Indtast!Q$33),0)*$O$1+$B44,\"x\"))","v":"18:19:00"},{"$f":"IF(Indtast!R32<>\"\",ROUND((60/$P44*Indtast!R$32),0)*$O$1+$B44,IF(Indtast!R33<>\"\",ROUND((60/$P44*Indtast!R$33),0)*$O$1+$B44,\"x\"))","v":"18:40:00"},{"$f":"IF(Indtast!S32<>\"\",ROUND((60/$P44*Indtast!S$32),0)*$O$1+$B44,IF(Indtast!S33<>\"\",ROUND((60/$P44*Indtast!S$33),0)*$O$1+$B44,\"x\"))","v":"19:00:00"},{"$f":"IF(Indtast!T32<>\"\",ROUND((60/$P44*Indtast!T$32),0)*$O$1+$B44,IF(Indtast!T33<>\"\",ROUND((60/$P44*Indtast!T$33),0)*$O$1+$B44,\"x\"))","v":"19:20:00"},null,{"$f":"Indtast!$E$32","v":44}]
[{"$f":"Indtast!A32&\" \"&Indtast!$D$2","v":"A Mel"},{"$f":"IF(Indtast!$B$32<>\"\",Indtast!$B$32,\"\")","v":"15:15:00"},{"$f":"IF(Indtast!I32<>\"\",ROUND((60/$P45*Indtast!I$32),0)*$O$1+$B45,IF(Indtast!I33<>\"\",ROUND((60/$P45*Indtast!I$33),0)*$O$1+$B45,\"x\"))","v":"15:35:00"},{"$f":"IF(Indtast!J32<>\"\",ROUND((60/$P45*Indtast!J$32),0)*$O$1+$B45,IF(Indtast!J33<>\"\",ROUND((60/$P45*Indtast!J$33),0)*$O$1+$B45,\"x\"))","v":"15:55:00"},{"$f":"IF(Indtast!K32<>\"\",ROUND((60/$P45*Indtast!K$32),0)*$O$1+$B45,IF(Indtast!K33<>\"\",ROUND((60/$P45*Indtast!K$33),0)*$O$1+$B45,\"x\"))","v":"16:15:00"},{"$f":"IF(Indtast!L32<>\"\",ROUND((60/$P45*Indtast!L$32),0)*$O$1+$B45,IF(Indtast!L33<>\"\",ROUND((60/$P45*Indtast!L$33),0)*$O$1+$B45,\"x\"))","v":"16:35:00"},{"$f":"IF(Indtast!M32<>\"\",ROUND((60/$P45*Indtast!M$32),0)*$O$1+$B45,IF(Indtast!M33<>\"\",ROUND((60/$P45*Indtast!M$33),0)*$O$1+$B45,\"x\"))","v":"16:55:00"},{"$f":"IF(Indtast!N32<>\"\",ROUND((60/$P45*Indtast!N$32),0)*$O$1+$B45,IF(Indtast!N33<>\"\",ROUND((60/$P45*Indtast!N$33),0)*$O$1+$B45,\"x\"))","v":"17:15:00"},{"$f":"IF(Indtast!O32<>\"\",ROUND((60/$P45*Indtast!O$32),0)*$O$1+$B45,IF(Indtast!O33<>\"\",ROUND((60/$P45*Indtast!O$33),0)*$O$1+$B45,\"x\"))","v":"17:35:00"},{"$f":"IF(Indtast!P32<>\"\",ROUND((60/$P45*Indtast!P$32),0)*$O$1+$B45,IF(Indtast!P33<>\"\",ROUND((60/$P45*Indtast!P$33),0)*$O$1+$B45,\"x\"))","v":"17:55:00"},{"$f":"IF(Indtast!Q32<>\"\",ROUND((60/$P45*Indtast!Q$32),0)*$O$1+$B45,IF(Indtast!Q33<>\"\",ROUND((60/$P45*Indtast!Q$33),0)*$O$1+$B45,\"x\"))","v":"18:15:00"},{"$f":"IF(Indtast!R32<>\"\",ROUND((60/$P45*Indtast!R$32),0)*$O$1+$B45,IF(Indtast!R33<>\"\",ROUND((60/$P45*Indtast!R$33),0)*$O$1+$B45,\"x\"))","v":"18:35:00"},{"$f":"IF(Indtast!S32<>\"\",ROUND((60/$P45*Indtast!S$32),0)*$O$1+$B45,IF(Indtast!S33<>\"\",ROUND((60/$P45*Indtast!S$33),0)*$O$1+$B45,\"x\"))","v":"18:55:00"},{"$f":"IF(Indtast!T32<>\"\",ROUND((60/$P45*Indtast!T$32),0)*$O$1+$B45,IF(Indtast!T33<>\"\",ROUND((60/$P45*Indtast!T$33),0)*$O$1+$B45,\"x\"))","v":"19:15:00"},null,{"$f":"Indtast!$D$32","v":45}]
[{"$f":"Indtast!A32&\" \"&Indtast!$C$2","v":"A Høj"},{"$f":"IF(Indtast!$B$32<>\"\",Indtast!$B$32,\"\")","v":"15:15:00"},{"$f":"IF(Indtast!I32<>\"\",ROUND((60/$P46*Indtast!I$32),0)*$O$1+$B46,IF(Indtast!I33<>\"\",ROUND((60/$P46*Indtast!I$33),0)*$O$1+$B46,\"x\"))","v":"15:35:00"},{"$f":"IF(Indtast!J32<>\"\",ROUND((60/$P46*Indtast!J$32),0)*$O$1+$B46,IF(Indtast!J33<>\"\",ROUND((60/$P46*Indtast!J$33),0)*$O$1+$B46,\"x\"))","v":"15:54:00"},{"$f":"IF(Indtast!K32<>\"\",ROUND((60/$P46*Indtast!K$32),0)*$O$1+$B46,IF(Indtast!K33<>\"\",ROUND((60/$P46*Indtast!K$33),0)*$O$1+$B46,\"x\"))","v":"16:14:00"},{"$f":"IF(Indtast!L32<>\"\",ROUND((60/$P46*Indtast!L$32),0)*$O$1+$B46,IF(Indtast!L33<>\"\",ROUND((60/$P46*Indtast!L$33),0)*$O$1+$B46,\"x\"))","v":"16:33:00"},{"$f":"IF(Indtast!M32<>\"\",ROUND((60/$P46*Indtast!M$32),0)*$O$1+$B46,IF(Indtast!M33<>\"\",ROUND((60/$P46*Indtast!M$33),0)*$O$1+$B46,\"x\"))","v":"16:53:00"},{"$f":"IF(Indtast!N32<>\"\",ROUND((60/$P46*Indtast!N$32),0)*$O$1+$B46,IF(Indtast!N33<>\"\",ROUND((60/$P46*Indtast!N$33),0)*$O$1+$B46,\"x\"))","v":"17:12:00"},{"$f":"IF(Indtast!O32<>\"\",ROUND((60/$P46*Indtast!O$32),0)*$O$1+$B46,IF(Indtast!O33<>\"\",ROUND((60/$P46*Indtast!O$33),0)*$O$1+$B46,\"x\"))","v":"17:32:00"},{"$f":"IF(Indtast!P32<>\"\",ROUND((60/$P46*Indtast!P$32),0)*$O$1+$B46,IF(Indtast!P33<>\"\",ROUND((60/$P46*Indtast!P$33),0)*$O$1+$B46,\"x\"))","v":"17:52:00"},{"$f":"IF(Indtast!Q32<>\"\",ROUND((60/$P46*Indtast!Q$32),0)*$O$1+$B46,IF(Indtast!Q33<>\"\",ROUND((60/$P46*Indtast!Q$33),0)*$O$1+$B46,\"x\"))","v":"18:11:00"},{"$f":"IF(Indtast!R32<>\"\",ROUND((60/$P46*Indtast!R$32),0)*$O$1+$B46,IF(Indtast!R33<>\"\",ROUND((60/$P46*Indtast!R$33),0)*$O$1+$B46,\"x\"))","v":"18:31:00"},{"$f":"IF(Indtast!S32<>\"\",ROUND((60/$P46*Indtast!S$32),0)*$O$1+$B46,IF(Indtast!S33<>\"\",ROUND((60/$P46*Indtast!S$33),0)*$O$1+$B46,\"x\"))","v":"18:50:00"},{"$f":"IF(Indtast!T32<>\"\",ROUND((60/$P46*Indtast!T$32),0)*$O$1+$B46,IF(Indtast!T33<>\"\",ROUND((60/$P46*Indtast!T$33),0)*$O$1+$B46,\"x\"))","v":"19:10:00"},null,{"$f":"Indtast!$C$32","v":46}]
[{"$f":"Indtast!$A18&\" \"&Indtast!$E$2","v":"B Lav"},{"$f":"IF(Indtast!$B$18<>\"\",Indtast!$B$18,\"\")","v":"15:17:00"},{"$f":"IF(Indtast!I18<>\"\",ROUND((60/$P47*Indtast!I$18),0)*$O$1+$B47,IF(Indtast!I19<>\"\",ROUND((60/$P47*Indtast!I$19),0)*$O$1+$B47,\"x\"))","v":"15:38:00"},{"$f":"IF(Indtast!J18<>\"\",ROUND((60/$P47*Indtast!J$18),0)*$O$1+$B47,IF(Indtast!J19<>\"\",ROUND((60/$P47*Indtast!J$19),0)*$O$1+$B47,\"x\"))","v":"16:00:00"},{"$f":"IF(Indtast!K18<>\"\",ROUND((60/$P47*Indtast!K$18),0)*$O$1+$B47,IF(Indtast!K19<>\"\",ROUND((60/$P47*Indtast!K$19),0)*$O$1+$B47,\"x\"))","v":"16:21:00"},{"$f":"IF(Indtast!L18<>\"\",ROUND((60/$P47*Indtast!L$18),0)*$O$1+$B47,IF(Indtast!L19<>\"\",ROUND((60/$P47*Indtast!L$19),0)*$O$1+$B47,\"x\"))","v":"16:43:00"},{"$f":"IF(Indtast!M18<>\"\",ROUND((60/$P47*Indtast!M$18),0)*$O$1+$B47,IF(Indtast!M19<>\"\",ROUND((60/$P47*Indtast!M$19),0)*$O$1+$B47,\"x\"))","v":"17:04:00"},{"$f":"IF(Indtast!N18<>\"\",ROUND((60/$P47*Indtast!N$18),0)*$O$1+$B47,IF(Indtast!N19<>\"\",ROUND((60/$P47*Indtast!N$19),0)*$O$1+$B47,\"x\"))","v":"17:26:00"},{"$f":"IF(Indtast!O18<>\"\",ROUND((60/$P47*Indtast!O$18),0)*$O$1+$B47,IF(Indtast!O19<>\"\",ROUND((60/$P47*Indtast!O$19),0)*$O$1+$B47,\"x\"))","v":"17:47:00"},{"$f":"IF(Indtast!P18<>\"\",ROUND((60/$P47*Indtast!P$18),0)*$O$1+$B47,IF(Indtast!P19<>\"\",ROUND((60/$P47*Indtast!P$19),0)*$O$1+$B47,\"x\"))","v":"18:08:00"},{"$f":"IF(Indtast!Q18<>\"\",ROUND((60/$P47*Indtast!Q$18),0)*$O$1+$B47,IF(Indtast!Q19<>\"\",ROUND((60/$P47*Indtast!Q$19),0)*$O$1+$B47,\"x\"))","v":"x"},{"$f":"IF(Indtast!R18<>\"\",ROUND((60/$P47*Indtast!R$18),0)*$O$1+$B47,IF(Indtast!R19<>\"\",ROUND((60/$P47*Indtast!R$19),0)*$O$1+$B47,\"x\"))","v":"x"},{"$f":"IF(Indtast!S18<>\"\",ROUND((60/$P47*Indtast!S$18),0)*$O$1+$B47,IF(Indtast!S19<>\"\",ROUND((60/$P47*Indtast!S$19),0)*$O$1+$B47,\"x\"))","v":"x"},{"$f":"IF(Indtast!T18<>\"\",ROUND((60/$P47*Indtast!T$18),0)*$O$1+$B47,IF(Indtast!T19<>\"\",ROUND((60/$P47*Indtast!T$19),0)*$O$1+$B47,\"x\"))","v":"x"},null,{"$f":"Indtast!$E$18","v":42}]
[{"$f":"Indtast!A18&\" \"&Indtast!$D$2","v":"B Mel"},{"$f":"IF(Indtast!$B$18<>\"\",Indtast!$B$18,\"\")","v":"15:17:00"},{"$f":"IF(Indtast!I18<>\"\",ROUND((60/$P48*Indtast!I$18),0)*$O$1+$B48,IF(Indtast!I19<>\"\",ROUND((60/$P48*Indtast!I$19),0)*$O$1+$B48,\"x\"))","v":"15:38:00"},{"$f":"IF(Indtast!J18<>\"\",ROUND((60/$P48*Indtast!J$18),0)*$O$1+$B48,IF(Indtast!J19<>\"\",ROUND((60/$P48*Indtast!J$19),0)*$O$1+$B48,\"x\"))","v":"15:59:00"},{"$f":"IF(Indtast!K18<>\"\",ROUND((60/$P48*Indtast!K$18),0)*$O$1+$B48,IF(Indtast!K19<>\"\",ROUND((60/$P48*Indtast!K$19),0)*$O$1+$B48,\"x\"))","v":"16:20:00"},{"$f":"IF(Indtast!L18<>\"\",ROUND((60/$P48*Indtast!L$18),0)*$O$1+$B48,IF(Indtast!L19<>\"\",ROUND((60/$P48*Indtast!L$19),0)*$O$1+$B48,\"x\"))","v":"16:41:00"},{"$f":"IF(Indtast!M18<>\"\",ROUND((60/$P48*Indtast!M$18),0)*$O$1+$B48,IF(Indtast!M19<>\"\",ROUND((60/$P48*Indtast!M$19),0)*$O$1+$B48,\"x\"))","v":"17:02:00"},{"$f":"IF(Indtast!N18<>\"\",ROUND((60/$P48*Indtast!N$18),0)*$O$1+$B48,IF(Indtast!N19<>\"\",ROUND((60/$P48*Indtast!N$19),0)*$O$1+$B48,\"x\"))","v":"17:23:00"},{"$f":"IF(Indtast!O18<>\"\",ROUND((60/$P48*Indtast!O$18),0)*$O$1+$B48,IF(Indtast!O19<>\"\",ROUND((60/$P48*Indtast!O$19),0)*$O$1+$B48,\"x\"))","v":"17:44:00"},{"$f":"IF(Indtast!P18<>\"\",ROUND((60/$P48*Indtast!P$18),0)*$O$1+$B48,IF(Indtast!P19<>\"\",ROUND((60/$P48*Indtast!P$19),0)*$O$1+$B48,\"x\"))","v":"18:04:00"},{"$f":"IF(Indtast!Q18<>\"\",ROUND((60/$P48*Indtast!Q$18),0)*$O$1+$B48,IF(Indtast!Q19<>\"\",ROUND((60/$P48*Indtast!Q$19),0)*$O$1+$B48,\"x\"))","v":"x"},{"$f":"IF(Indtast!R18<>\"\",ROUND((60/$P48*Indtast!R$18),0)*$O$1+$B48,IF(Indtast!R19<>\"\",ROUND((60/$P48*Indtast!R$19),0)*$O$1+$B48,\"x\"))","v":"x"},{"$f":"IF(Indtast!S18<>\"\",ROUND((60/$P48*Indtast!S$18),0)*$O$1+$B48,IF(Indtast!S19<>\"\",ROUND((60/$P48*Indtast!S$19),0)*$O$1+$B48,\"x\"))","v":"x"},{"$f":"IF(Indtast!T18<>\"\",ROUND((60/$P48*Indtast!T$18),0)*$O$1+$B48,IF(Indtast!T19<>\"\",ROUND((60/$P48*Indtast!T$19),0)*$O$1+$B48,\"x\"))","v":"x"},null,{"$f":"Indtast!$D$18","v":43}]
[{"$f":"Indtast!A18&\" \"&Indtast!$C$2","v":"B Høj"},{"$f":"IF(Indtast!$B$18<>\"\",Indtast!$B$18,\"\")","v":"15:17:00"},{"$f":"IF(Indtast!I18<>\"\",ROUND((60/$P49*Indtast!I$18),0)*$O$1+$B49,IF(Indtast!I19<>\"\",ROUND((60/$P49*Indtast!I$19),0)*$O$1+$B49,\"x\"))","v":"15:37:00"},{"$f":"IF(Indtast!J18<>\"\",ROUND((60/$P49*Indtast!J$18),0)*$O$1+$B49,IF(Indtast!J19<>\"\",ROUND((60/$P49*Indtast!J$19),0)*$O$1+$B49,\"x\"))","v":"15:58:00"},{"$f":"IF(Indtast!K18<>\"\",ROUND((60/$P49*Indtast!K$18),0)*$O$1+$B49,IF(Indtast!K19<>\"\",ROUND((60/$P49*Indtast!K$19),0)*$O$1+$B49,\"x\"))","v":"16:18:00"},{"$f":"IF(Indtast!L18<>\"\",ROUND((60/$P49*Indtast!L$18),0)*$O$1+$B49,IF(Indtast!L19<>\"\",ROUND((60/$P49*Indtast!L$19),0)*$O$1+$B49,\"x\"))","v":"16:39:00"},{"$f":"IF(Indtast!M18<>\"\",ROUND((60/$P49*Indtast!M$18),0)*$O$1+$B49,IF(Indtast!M19<>\"\",ROUND((60/$P49*Indtast!M$19),0)*$O$1+$B49,\"x\"))","v":"16:59:00"},{"$f":"IF(Indtast!N18<>\"\",ROUND((60/$P49*Indtast!N$18),0)*$O$1+$B49,IF(Indtast!N19<>\"\",ROUND((60/$P49*Indtast!N$19),0)*$O$1+$B49,\"x\"))","v":"17:20:00"},{"$f":"IF(Indtast!O18<>\"\",ROUND((60/$P49*Indtast!O$18),0)*$O$1+$B49,IF(Indtast!O19<>\"\",ROUND((60/$P49*Indtast!O$19),0)*$O$1+$B49,\"x\"))","v":"17:40:00"},{"$f":"IF(Indtast!P18<>\"\",ROUND((60/$P49*Indtast!P$18),0)*$O$1+$B49,IF(Indtast!P19<>\"\",ROUND((60/$P49*Indtast!P$19),0)*$O$1+$B49,\"x\"))","v":"18:01:00"},{"$f":"IF(Indtast!Q18<>\"\",ROUND((60/$P49*Indtast!Q$18),0)*$O$1+$B49,IF(Indtast!Q19<>\"\",ROUND((60/$P49*Indtast!Q$19),0)*$O$1+$B49,\"x\"))","v":"x"},{"$f":"IF(Indtast!R18<>\"\",ROUND((60/$P49*Indtast!R$18),0)*$O$1+$B49,IF(Indtast!R19<>\"\",ROUND((60/$P49*Indtast!R$19),0)*$O$1+$B49,\"x\"))","v":"x"},{"$f":"IF(Indtast!S18<>\"\",ROUND((60/$P49*Indtast!S$18),0)*$O$1+$B49,IF(Indtast!S19<>\"\",ROUND((60/$P49*Indtast!S$19),0)*$O$1+$B49,\"x\"))","v":"x"},{"$f":"IF(Indtast!T18<>\"\",ROUND((60/$P49*Indtast!T$18),0)*$O$1+$B49,IF(Indtast!T19<>\"\",ROUND((60/$P49*Indtast!T$19),0)*$O$1+$B49,\"x\"))","v":"x"},null,{"$f":"Indtast!$C$18","v":44}]

{"sheet":"Tidsskema kopi","index":11,"n_rows":197,"n_cols":5,"rows_kept":197,"cut":false,"hidden":true,"merged":[]}
["Klasse","Forventet kl.",null,"Resterende omgange","Faktisk tid"]
[{"$f":"Data!$A$6","v":"U15 + U16P Mel"},{"$f":"IF(Data!$B$6<>\"\",Data!$B$6)","v":"08:00:00"},{"$f":"IF(B3=FALSE,IF(B2<>FALSE,\"Mål\"),IF(B2<>FALSE,\"Start\"))","v":"Start"},{"$f":"IF(C2=\"Mål\",\"\",IF(C3=\"Mål\",1,IF(C2<>FALSE,D3+1)))","v":3}]
[{"$f":"Data!$A$6","v":"U15 + U16P Mel"},{"$f":"IF(Data!$C$6<>\"\",Data!$C$6)","v":"08:26:00"},{"$f":"IF(B4=FALSE,IF(B3<>FALSE,\"Mål\"),IF(B3<>FALSE,\"2. omgang\"))","v":"2. omgang"},2]
[{"$f":"Data!$A$6","v":"U15 + U16P Mel"},{"$f":"IF(Data!$D$6<>\"\",Data!$D$6)","v":"08:53:00"},{"$f":"IF(B5=FALSE,IF(B4<>FALSE,\"Mål\"),IF(B4<>FALSE,\"3. omgang\"))","v":"3. omgang"},1]
[{"$f":"Data!$A$6","v":"U15 + U16P Mel"},{"$f":"IF(Data!$E$6<>\"\",Data!$E$6)","v":"09:19:00"},{"$f":"IF(B6=FALSE,IF(B5<>FALSE,\"Mål\"),IF(B5<>FALSE,\"4. omgang\"))","v":"Mål"},""]
[{"$f":"Data!$A$6","v":"U15 + U16P Mel"},{"$f":"IF(Data!$F$6<>\"\",Data!$F$6)","v":false},{"$f":"IF(B7=FALSE,IF(B6<>FALSE,\"Mål\"),IF(B6<>FALSE,\"5. omgang\"))","v":false},false]
[{"$f":"Data!$A$6","v":"U15 + U16P Mel"},{"$f":"IF(Data!$G$6<>\"\",Data!$G$6)","v":false},{"$f":"IF(B8=FALSE,IF(B7<>FALSE,\"Mål\"),IF(B7<>FALSE,\"6. omgang\"))","v":false},false]
[{"$f":"Data!$A$6","v":"U15 + U16P Mel"},{"$f":"IF(Data!$H$6<>\"\",Data!$H$6)","v":false},{"$f":"IF(B9=FALSE,IF(B8<>FALSE,\"Mål\"),IF(B8<>FALSE,\"7. omgang\"))","v":false},false]
[{"$f":"Data!$A$6","v":"U15 + U16P Mel"},{"$f":"IF(Data!$I$6<>\"\",Data!$I$6)","v":false},{"$f":"IF(B10=FALSE,IF(B9<>FALSE,\"Mål\"),IF(B9<>FALSE,\"8. omgang\"))","v":false},false]
[{"$f":"Data!$A$6","v":"U15 + U16P Mel"},{"$f":"IF(Data!$J$6<>\"\",Data!$J$6)","v":false},{"$f":"IF(B11=FALSE,IF(B10<>FALSE,\"Mål\"),IF(B10<>FALSE,\"9. omgang\"))","v":false},false]
[{"$f":"Data!$A$6","v":"U15 + U16P Mel"},{"$f":"IF(Data!$K$6<>\"\",Data!$K$6)","v":false},{"$f":"IF(B12=FALSE,IF(B11<>FALSE,\"Mål\"),IF(B11<>FALSE,\"10. omgang\"))","v":false},false]
[{"$f":"Data!$A$6","v":"U15 + U16P Mel"},{"$f":"IF(Data!$L$6<>\"\",Data!$L$6)","v":false},{"$f":"IF(B13=FALSE,IF(B12<>FALSE,\"Mål\"),IF(B12<>FALSE,\"11. omgang\"))","v":false},false]
[{"$f":"Data!$A$6","v":"U15 + U16P Mel"},{"$f":"IF(Data!$M$6<>\"\",Data!$M$6)","v":false},{"$f":"IF(B14=FALSE,IF(B13<>FALSE,\"Mål\"),IF(B13<>FALSE,\"12. omgang\"))","v":false},false]
[{"$f":"Data!$A$6","v":"U15 + U16P Mel"},{"$f":"IF(Data!$N$6<>\"\",Data!$N$6)","v":false},{"$f":"IF(B14=FALSE,IF(B14<>FALSE,\"Mål\"),\"Mål\")","v":false},false]
[{"$f":"Data!$A$9","v":"U13 Mel"},{"$f":"IF(Data!$B$9<>\"\",Data!$B$9)","v":"08:02:00"},{"$f":"IF(B16=FALSE,IF(B15<>FALSE,\"Mål\"),IF(B15<>FALSE,\"Start\"))","v":"Start"},{"$f":"IF(C15=\"Mål\",\"\",IF(C16=\"Mål\",1,IF(C15<>FALSE,D16+1)))","v":2}]
[{"$f":"Data!$A$9","v":"U13 Mel"},{"$f":"IF(Data!$C$9<>\"\",Data!$C$9)","v":"08:31:00"},{"$f":"IF(B17=FALSE,IF(B16<>FALSE,\"Mål\"),IF(B16<>FALSE,\"2. omgang\"))","v":"2. omgang"},1]
[{"$f":"Data!$A$9","v":"U13 Mel"},{"$f":"IF(Data!$D$9<>\"\",Data!$D$9)","v":"09:00:00"},{"$f":"IF(B18=FALSE,IF(B17<>FALSE,\"Mål\"),IF(B17<>FALSE,\"3. omgang\"))","v":"Mål"},""]
[{"$f":"Data!$A$9","v":"U13 Mel"},{"$f":"IF(Data!$E$9<>\"\",Data!$E$9)","v":false},{"$f":"IF(B19=FALSE,IF(B18<>FALSE,\"Mål\"),IF(B18<>FALSE,\"4. omgang\"))","v":false},false]
[{"$f":"Data!$A$9","v":"U13 Mel"},{"$f":"IF(Data!$F$9<>\"\",Data!$F$9)","v":false},{"$f":"IF(B20=FALSE,IF(B19<>FALSE,\"Mål\"),IF(B19<>FALSE,\"5. omgang\"))","v":false},false]
[{"$f":"Data!$A$9","v":"U13 Mel"},{"$f":"IF(Data!$G$9<>\"\",Data!$G$9)","v":false},{"$f":"IF(B21=FALSE,IF(B20<>FALSE,\"Mål\"),IF(B20<>FALSE,\"6. omgang\"))","v":false},false]
[{"$f":"Data!$A$9","v":"U13 Mel"},{"$f":"IF(Data!$H$9<>\"\",Data!$H$9)","v":false},{"$f":"IF(B22=FALSE,IF(B21<>FALSE,\"Mål\"),IF(B21<>FALSE,\"7. omgang\"))","v":false},false]
[{"$f":"Data!$A$9","v":"U13 Mel"},{"$f":"IF(Data!$I$9<>\"\",Data!$I$9)","v":false},{"$f":"IF(B23=FALSE,IF(B22<>FALSE,\"Mål\"),IF(B22<>FALSE,\"8. omgang\"))","v":false},false]
[{"$f":"Data!$A$9","v":"U13 Mel"},{"$f":"IF(Data!$J$9<>\"\",Data!$J$9)","v":false},{"$f":"IF(B24=FALSE,IF(B23<>FALSE,\"Mål\"),IF(B23<>FALSE,\"9. omgang\"))","v":false},false]
[{"$f":"Data!$A$9","v":"U13 Mel"},{"$f":"IF(Data!$K$9<>\"\",Data!$K$9)","v":false},{"$f":"IF(B25=FALSE,IF(B24<>FALSE,\"Mål\"),IF(B24<>FALSE,\"10. omgang\"))","v":false},false]
[{"$f":"Data!$A$9","v":"U13 Mel"},{"$f":"IF(Data!$L$9<>\"\",Data!$L$9)","v":false},{"$f":"IF(B26=FALSE,IF(B25<>FALSE,\"Mål\"),IF(B25<>FALSE,\"11. omgang\"))","v":false},false]
[{"$f":"Data!$A$9","v":"U13 Mel"},{"$f":"IF(Data!$M$9<>\"\",Data!$M$9)","v":false},{"$f":"IF(B27=FALSE,IF(B26<>FALSE,\"Mål\"),IF(B26<>FALSE,\"12. omgang\"))","v":false},false]
[{"$f":"Data!$A$9","v":"U13 Mel"},{"$f":"IF(Data!$N$9<>\"\",Data!$N$9)","v":false},{"$f":"IF(B27=FALSE,IF(B27<>FALSE,\"Mål\"),\"Mål\")","v":false},false]
[{"$f":"Data!$A$12","v":"U11 Mel"},{"$f":"IF(Data!$B$12<>\"\",Data!$B$12)","v":"08:05:00"},{"$f":"IF(B29=FALSE,IF(B28<>FALSE,\"Mål\"),IF(B28<>FALSE,\"Start\"))","v":"Start"},1]
[{"$f":"Data!$A$12","v":"U11 Mel"},{"$f":"IF(Data!$C$12<>\"\",Data!$C$12)","v":"08:36:00"},{"$f":"IF(B30=FALSE,IF(B29<>FALSE,\"Mål\"),IF(B29<>FALSE,\"2. omgang\"))","v":"Mål"},""]
[{"$f":"Data!$A$12","v":"U11 Mel"},{"$f":"IF(Data!$D$12<>\"\",Data!$D$12)","v":false},{"$f":"IF(B31=FALSE,IF(B30<>FALSE,\"Mål\"),IF(B30<>FALSE,\"3. omgang\"))","v":false},false]
[{"$f":"Data!$A$12","v":"U11 Mel"},{"$f":"IF(Data!$E$12<>\"\",Data!$E$12)","v":false},{"$f":"IF(B32=FALSE,IF(B31<>FALSE,\"Mål\"),IF(B31<>FALSE,\"4. omgang\"))","v":false},false]
[{"$f":"Data!$A$12","v":"U11 Mel"},{"$f":"IF(Data!$F$12<>\"\",Data!$F$12)","v":false},{"$f":"IF(B33=FALSE,IF(B32<>FALSE,\"Mål\"),IF(B32<>FALSE,\"5. omgang\"))","v":false},false]
[{"$f":"Data!$A$12","v":"U11 Mel"},{"$f":"IF(Data!$G$12<>\"\",Data!$G$12)","v":false},{"$f":"IF(B34=FALSE,IF(B33<>FALSE,\"Mål\"),IF(B33<>FALSE,\"6. omgang\"))","v":false},false]
[{"$f":"Data!$A$12","v":"U11 Mel"},{"$f":"IF(Data!$H$12<>\"\",Data!$H$12)","v":false},{"$f":"IF(B35=FALSE,IF(B34<>FALSE,\"Mål\"),IF(B34<>FALSE,\"7. omgang\"))","v":false},false]
[{"$f":"Data!$A$12","v":"U11 Mel"},{"$f":"IF(Data!$I$12<>\"\",Data!$I$12)","v":false},{"$f":"IF(B36=FALSE,IF(B35<>FALSE,\"Mål\"),IF(B35<>FALSE,\"8. omgang\"))","v":false},false]
[{"$f":"Data!$A$12","v":"U11 Mel"},{"$f":"IF(Data!$J$12<>\"\",Data!$J$12)","v":false},{"$f":"IF(B37=FALSE,IF(B36<>FALSE,\"Mål\"),IF(B36<>FALSE,\"9. omgang\"))","v":false},false]
[{"$f":"Data!$A$12","v":"U11 Mel"},{"$f":"IF(Data!$K$12<>\"\",Data!$K$12)","v":false},{"$f":"IF(B38=FALSE,IF(B37<>FALSE,\"Mål\"),IF(B37<>FALSE,\"10. omgang\"))","v":false},false]
[{"$f":"Data!$A$12","v":"U11 Mel"},{"$f":"IF(Data!$L$12<>\"\",Data!$L$12)","v":false},{"$f":"IF(B39=FALSE,IF(B38<>FALSE,\"Mål\"),IF(B38<>FALSE,\"11. omgang\"))","v":false},false]
[{"$f":"Data!$A$12","v":"U11 Mel"},{"$f":"IF(Data!$M$12<>\"\",Data!$M$12)","v":false},{"$f":"IF(B40=FALSE,IF(B39<>FALSE,\"Mål\"),IF(B39<>FALSE,\"12. omgang\"))","v":false},false]
[{"$f":"Data!$A$12","v":"U11 Mel"},{"$f":"IF(Data!$N$12<>\"\",Data!$N$12)","v":false},{"$f":"IF(B40=FALSE,IF(B40<>FALSE,\"Mål\"),\"Mål\")","v":false},false]
[{"$f":"Data!$A$15","v":"U17 + DJUN Mel"},{"$f":"IF(Data!$B$15<>\"\",Data!$B$15)","v":"09:15:00"},{"$f":"IF(B42=FALSE,IF(B41<>FALSE,\"Mål\"),IF(B41<>FALSE,\"Start\"))","v":"Start"},{"$f":"IF(C41=\"Mål\",\"\",IF(C42=\"Mål\",1,IF(C41<>FALSE,D42+1)))","v":5}]
[{"$f":"Data!$A$15","v":"U17 + DJUN Mel"},{"$f":"IF(Data!$C$15<>\"\",Data!$C$15)","v":"09:38:00"},{"$f":"IF(B43=FALSE,IF(B42<>FALSE,\"Mål\"),IF(B42<>FALSE,\"2. omgang\"))","v":"2. omgang"},4]
[{"$f":"Data!$A$15","v":"U17 + DJUN Mel"},{"$f":"IF(Data!$D$15<>\"\",Data!$D$15)","v":"10:01:00"},{"$f":"IF(B44=FALSE,IF(B43<>FALSE,\"Mål\"),IF(B43<>FALSE,\"3. omgang\"))","v":"3. omgang"},3]
[{"$f":"Data!$A$15","v":"U17 + DJUN Mel"},{"$f":"IF(Data!$E$15<>\"\",Data!$E$15)","v":"10:24:00"},{"$f":"IF(B45=FALSE,IF(B44<>FALSE,\"Mål\"),IF(B44<>FALSE,\"4. omgang\"))","v":"4. omgang"},2]
[{"$f":"Data!$A$15","v":"U17 + DJUN Mel"},{"$f":"IF(Data!$F$15<>\"\",Data!$F$15)","v":"10:47:00"},{"$f":"IF(B46=FALSE,IF(B45<>FALSE,\"Mål\"),IF(B45<>FALSE,\"5. omgang\"))","v":"5. omgang"},1]
[{"$f":"Data!$A$15","v":"U17 + DJUN Mel"},{"$f":"IF(Data!$G$15<>\"\",Data!$G$15)","v":"11:10:00"},{"$f":"IF(B47=FALSE,IF(B46<>FALSE,\"Mål\"),IF(B46<>FALSE,\"6. omgang\"))","v":"Mål"},""]
[{"$f":"Data!$A$15","v":"U17 + DJUN Mel"},{"$f":"IF(Data!$H$15<>\"\",Data!$H$15)","v":false},{"$f":"IF(B48=FALSE,IF(B47<>FALSE,\"Mål\"),IF(B47<>FALSE,\"7. omgang\"))","v":false},false]
[{"$f":"Data!$A$15","v":"U17 + DJUN Mel"},{"$f":"IF(Data!$I$15<>\"\",Data!$I$15)","v":false},{"$f":"IF(B49=FALSE,IF(B48<>FALSE,\"Mål\"),IF(B48<>FALSE,\"8. omgang\"))","v":false},false]
[{"$f":"Data!$A$15","v":"U17 + DJUN Mel"},{"$f":"IF(Data!$J$15<>\"\",Data!$J$15)","v":false},{"$f":"IF(B50=FALSE,IF(B49<>FALSE,\"Mål\"),IF(B49<>FALSE,\"9. omgang\"))","v":false},false]
[{"$f":"Data!$A$15","v":"U17 + DJUN Mel"},{"$f":"IF(Data!$K$15<>\"\",Data!$K$15)","v":false},{"$f":"IF(B51=FALSE,IF(B50<>FALSE,\"Mål\"),IF(B50<>FALSE,\"10. omgang\"))","v":false},false]
[{"$f":"Data!$A$15","v":"U17 + DJUN Mel"},{"$f":"IF(Data!$L$15<>\"\",Data!$L$15)","v":false},{"$f":"IF(B52=FALSE,IF(B51<>FALSE,\"Mål\"),IF(B51<>FALSE,\"11. omgang\"))","v":false},false]
[{"$f":"Data!$A$15","v":"U17 + DJUN Mel"},{"$f":"IF(Data!$M$15<>\"\",Data!$M$15)","v":false},{"$f":"IF(B53=FALSE,IF(B52<>FALSE,\"Mål\"),IF(B52<>FALSE,\"12. omgang\"))","v":false},false]
[{"$f":"Data!$A$15","v":"U17 + DJUN Mel"},{"$f":"IF(Data!$N$15<>\"\",Data!$N$15)","v":false},{"$f":"IF(B53=FALSE,IF(B53<>FALSE,\"Mål\"),\"Mål\")","v":false},false]
[{"$f":"Data!$A$18","v":"DB Mel"},{"$f":"IF(Data!$B$18<>\"\",Data!$B$18)","v":"09:15:00"},{"$f":"IF(B55=FALSE,IF(B54<>FALSE,\"Mål\"),IF(B54<>FALSE,\"Start\"))","v":"Start"},{"$f":"IF(C54=\"Mål\",\"\",IF(C55=\"Mål\",1,IF(C54<>FALSE,D55+1)))","v":5}]
[{"$f":"Data!$A$18","v":"DB Mel"},{"$f":"IF(Data!$C$18<>\"\",Data!$C$18)","v":"09:39:00"},{"$f":"IF(B56=FALSE,IF(B55<>FALSE,\"Mål\"),IF(B55<>FALSE,\"2. omgang\"))","v":"2. omgang"},4]
[{"$f":"Data!$A$18","v":"DB Mel"},{"$f":"IF(Data!$D$18<>\"\",Data!$D$18)","v":"10:04:00"},{"$f":"IF(B57=FALSE,IF(B56<>FALSE,\"Mål\"),IF(B56<>FALSE,\"3. omgang\"))","v":"3. omgang"},3]
[{"$f":"Data!$A$18","v":"DB Mel"},{"$f":"IF(Data!$E$18<>\"\",Data!$E$18)","v":"10:28:00"},{"$f":"IF(B58=FALSE,IF(B57<>FALSE,\"Mål\"),IF(B57<>FALSE,\"4. omgang\"))","v":"4. omgang"},2]
[{"$f":"Data!$A$18","v":"DB Mel"},{"$f":"IF(Data!$F$18<>\"\",Data!$F$18)","v":"10:52:00"},{"$f":"IF(B59=FALSE,IF(B58<>FALSE,\"Mål\"),IF(B58<>FALSE,\"5. omgang\"))","v":"5. omgang"},1]
[{"$f":"Data!$A$18","v":"DB Mel"},{"$f":"IF(Data!$G$18<>\"\",Data!$G$18)","v":"11:17:00"},{"$f":"IF(B60=FALSE,IF(B59<>FALSE,\"Mål\"),IF(B59<>FALSE,\"6. omgang\"))","v":"Mål"},""]
[{"$f":"Data!$A$18","v":"DB Mel"},{"$f":"IF(Data!$H$18<>\"\",Data!$H$18)","v":false},{"$f":"IF(B61=FALSE,IF(B60<>FALSE,\"Mål\"),IF(B60<>FALSE,\"7. omgang\"))","v":false},false]
[{"$f":"Data!$A$18","v":"DB Mel"},{"$f":"IF(Data!$I$18<>\"\",Data!$I$18)","v":false},{"$f":"IF(B62=FALSE,IF(B61<>FALSE,\"Mål\"),IF(B61<>FALSE,\"8. omgang\"))","v":false},false]
[{"$f":"Data!$A$18","v":"DB Mel"},{"$f":"IF(Data!$J$18<>\"\",Data!$J$18)","v":false},{"$f":"IF(B63=FALSE,IF(B62<>FALSE,\"Mål\"),IF(B62<>FALSE,\"9. omgang\"))","v":false},false]
[{"$f":"Data!$A$18","v":"DB Mel"},{"$f":"IF(Data!$K$18<>\"\",Data!$K$18)","v":false},{"$f":"IF(B64=FALSE,IF(B63<>FALSE,\"Mål\"),IF(B63<>FALSE,\"10. omgang\"))","v":false},false]
[{"$f":"Data!$A$18","v":"DB Mel"},{"$f":"IF(Data!$L$18<>\"\",Data!$L$18)","v":false},{"$f":"IF(B65=FALSE,IF(B64<>FALSE,\"Mål\"),IF(B64<>FALSE,\"11. omgang\"))","v":false},false]
[{"$f":"Data!$A$18","v":"DB Mel"},{"$f":"IF(Data!$M$18<>\"\",Data!$M$18)","v":false},{"$f":"IF(B66=FALSE,IF(B65<>FALSE,\"Mål\"),IF(B65<>FALSE,\"12. omgang\"))","v":false},false]
[{"$f":"Data!$A$18","v":"DB Mel"},{"$f":"IF(Data!$N$18<>\"\",Data!$N$18)","v":false},{"$f":"IF(B66=FALSE,IF(B66<>FALSE,\"Mål\"),\"Mål\")","v":false},false]
[{"$f":"Data!$A$21","v":"U19 Mel"},{"$f":"IF(Data!$B$21<>\"\",Data!$B$21)","v":"09:30:00"},{"$f":"IF(B68=FALSE,IF(B67<>FALSE,\"Mål\"),IF(B67<>FALSE,\"Start\"))","v":"Start"},{"$f":"IF(C67=\"Mål\",\"\",IF(C68=\"Mål\",1,IF(C67<>FALSE,D68+1)))","v":6}]
[{"$f":"Data!$A$21","v":"U19 Mel"},{"$f":"IF(Data!$C$21<>\"\",Data!$C$21)","v":"09:51:00"},{"$f":"IF(B69=FALSE,IF(B68<>FALSE,\"Mål\"),IF(B68<>FALSE,\"2. omgang\"))","v":"2. omgang"},5]
[{"$f":"Data!$A$21","v":"U19 Mel"},{"$f":"IF(Data!$D$21<>\"\",Data!$D$21)","v":"10:12:00"},{"$f":"IF(B70=FALSE,IF(B69<>FALSE,\"Mål\"),IF(B69<>FALSE,\"3. omgang\"))","v":"3. omgang"},4]
[{"$f":"Data!$A$21","v":"U19 Mel"},{"$f":"IF(Data!$E$21<>\"\",Data!$E$21)","v":"10:33:00"},{"$f":"IF(B71=FALSE,IF(B70<>FALSE,\"Mål\"),IF(B70<>FALSE,\"4. omgang\"))","v":"4. omgang"},3]
[{"$f":"Data!$A$21","v":"U19 Mel"},{"$f":"IF(Data!$F$21<>\"\",Data!$F$21)","v":"10:54:00"},{"$f":"IF(B72=FALSE,IF(B71<>FALSE,\"Mål\"),IF(B71<>FALSE,\"5. omgang\"))","v":"5. omgang"},2]
[{"$f":"Data!$A$21","v":"U19 Mel"},{"$f":"IF(Data!$G$21<>\"\",Data!$G$21)","v":"11:15:00"},{"$f":"IF(B73=FALSE,IF(B72<>FALSE,\"Mål\"),IF(B72<>FALSE,\"6. omgang\"))","v":"6. omgang"},1]
[{"$f":"Data!$A$21","v":"U19 Mel"},{"$f":"IF(Data!$H$21<>\"\",Data!$H$21)","v":"11:36:00"},{"$f":"IF(B74=FALSE,IF(B73<>FALSE,\"Mål\"),IF(B73<>FALSE,\"7. omgang\"))","v":"Mål"},""]
[{"$f":"Data!$A$21","v":"U19 Mel"},{"$f":"IF(Data!$I$21<>\"\",Data!$I$21)","v":false},{"$f":"IF(B75=FALSE,IF(B74<>FALSE,\"Mål\"),IF(B74<>FALSE,\"8. omgang\"))","v":false},false]
[{"$f":"Data!$A$21","v":"U19 Mel"},{"$f":"IF(Data!$J$21<>\"\",Data!$J$21)","v":false},{"$f":"IF(B76=FALSE,IF(B75<>FALSE,\"Mål\"),IF(B75<>FALSE,\"9. omgang\"))","v":false},false]
[{"$f":"Data!$A$21","v":"U19 Mel"},{"$f":"IF(Data!$K$21<>\"\",Data!$K$21)","v":false},{"$f":"IF(B77=FALSE,IF(B76<>FALSE,\"Mål\"),IF(B76<>FALSE,\"10. omgang\"))","v":false},false]
[{"$f":"Data!$A$21","v":"U19 Mel"},{"$f":"IF(Data!$L$21<>\"\",Data!$L$21)","v":false},{"$f":"IF(B78=FALSE,IF(B77<>FALSE,\"Mål\"),IF(B77<>FALSE,\"11. omgang\"))","v":false},false]
[{"$f":"Data!$A$21","v":"U19 Mel"},{"$f":"IF(Data!$M$21<>\"\",Data!$M$21)","v":false},{"$f":"IF(B79=FALSE,IF(B78<>FALSE,\"Mål\"),IF(B78<>FALSE,\"12. omgang\"))","v":false},false]
[{"$f":"Data!$A$21","v":"U19 Mel"},{"$f":"IF(Data!$N$21<>\"\",Data!$N$21)","v":false},{"$f":"IF(B79=FALSE,IF(B79<>FALSE,\"Mål\"),\"Mål\")","v":false},false]
[{"$f":"Data!$A$24","v":"C Mel"},{"$f":"IF(Data!$B$24<>\"\",Data!$B$24)","v":"09:33:00"},{"$f":"IF(B81=FALSE,IF(B80<>FALSE,\"Mål\"),IF(B80<>FALSE,\"Start\"))","v":"Start"},{"$f":"IF(C80=\"Mål\",\"\",IF(C81=\"Mål\",1,IF(C80<>FALSE,D81+1)))","v":8}]
[{"$f":"Data!$A$24","v":"C Mel"},{"$f":"IF(Data!$C$24<>\"\",Data!$C$24)","v":"09:54:00"},{"$f":"IF(B82=FALSE,IF(B81<>FALSE,\"Mål\"),IF(B81<>FALSE,\"2. omgang\"))","v":"2. omgang"},7]
[{"$f":"Data!$A$24","v":"C Mel"},{"$f":"IF(Data!$D$24<>\"\",Data!$D$24)","v":"10:16:00"},{"$f":"IF(B83=FALSE,IF(B82<>FALSE,\"Mål\"),IF(B82<>FALSE,\"3. omgang\"))","v":"3. omgang"},6]
[{"$f":"Data!$A$24","v":"C Mel"},{"$f":"IF(Data!$E$24<>\"\",Data!$E$24)","v":"10:37:00"},{"$f":"IF(B84=FALSE,IF(B83<>FALSE,\"Mål\"),IF(B83<>FALSE,\"4. omgang\"))","v":"4. omgang"},5]
[{"$f":"Data!$A$24","v":"C Mel"},{"$f":"IF(Data!$F$24<>\"\",Data!$F$24)","v":"10:59:00"},{"$f":"IF(B85=FALSE,IF(B84<>FALSE,\"Mål\"),IF(B84<>FALSE,\"5. omgang\"))","v":"5. omgang"},4]
[{"$f":"Data!$A$24","v":"C Mel"},{"$f":"IF(Data!$G$24<>\"\",Data!$G$24)","v":"11:20:00"},{"$f":"IF(B86=FALSE,IF(B85<>FALSE,\"Mål\"),IF(B85<>FALSE,\"6. omgang\"))","v":"6. omgang"},3]
[{"$f":"Data!$A$24","v":"C Mel"},{"$f":"IF(Data!$H$24<>\"\",Data!$H$24)","v":"11:42:00"},{"$f":"IF(B87=FALSE,IF(B86<>FALSE,\"Mål\"),IF(B86<>FALSE,\"7. omgang\"))","v":"7. omgang"},2]
[{"$f":"Data!$A$24","v":"C Mel"},{"$f":"IF(Data!$I$24<>\"\",Data!$I$24)","v":"12:03:00"},{"$f":"IF(B88=FALSE,IF(B87<>FALSE,\"Mål\"),IF(B87<>FALSE,\"8. omgang\"))","v":"8. omgang"},1]
[{"$f":"Data!$A$24","v":"C Mel"},{"$f":"IF(Data!$J$24<>\"\",Data!$J$24)","v":"12:24:00"},{"$f":"IF(B89=FALSE,IF(B88<>FALSE,\"Mål\"),IF(B88<>FALSE,\"9. omgang\"))","v":"Mål"},""]
[{"$f":"Data!$A$24","v":"C Mel"},{"$f":"IF(Data!$K$24<>\"\",Data!$K$24)","v":false},{"$f":"IF(B90=FALSE,IF(B89<>FALSE,\"Mål\"),IF(B89<>FALSE,\"10. omgang\"))","v":false},false]
[{"$f":"Data!$A$24","v":"C Mel"},{"$f":"IF(Data!$L$24<>\"\",Data!$L$24)","v":false},{"$f":"IF(B91=FALSE,IF(B90<>FALSE,\"Mål\"),IF(B90<>FALSE,\"11. omgang\"))","v":false},false]
[{"$f":"Data!$A$24","v":"C Mel"},{"$f":"IF(Data!$M$24<>\"\",Data!$M$24)","v":false},{"$f":"IF(B92=FALSE,IF(B91<>FALSE,\"Mål\"),IF(B91<>FALSE,\"12. omgang\"))","v":false},false]
[{"$f":"Data!$A$24","v":"C Mel"},{"$f":"IF(Data!$N$24<>\"\",Data!$N$24)","v":false},{"$f":"IF(B92=FALSE,IF(B92<>FALSE,\"Mål\"),\"Mål\")","v":false},false]
[{"$f":"Data!$A$27","v":"DA Mel"},{"$f":"IF(Data!$B$27<>\"\",Data!$B$27)","v":"09:33:00"},{"$f":"IF(B94=FALSE,IF(B93<>FALSE,\"Mål\"),IF(B93<>FALSE,\"Start\"))","v":"Start"},{"$f":"IF(C93=\"Mål\",\"\",IF(C94=\"Mål\",1,IF(C93<>FALSE,D94+1)))","v":9}]
[{"$f":"Data!$A$27","v":"DA Mel"},{"$f":"IF(Data!$C$27<>\"\",Data!$C$27)","v":"09:54:00"},{"$f":"IF(B95=FALSE,IF(B94<>FALSE,\"Mål\"),IF(B94<>FALSE,\"2. omgang\"))","v":"2. omgang"},8]
[{"$f":"Data!$A$27","v":"DA Mel"},{"$f":"IF(Data!$D$27<>\"\",Data!$D$27)","v":"10:16:00"},{"$f":"IF(B96=FALSE,IF(B95<>FALSE,\"Mål\"),IF(B95<>FALSE,\"3. omgang\"))","v":"3. omgang"},7]
[{"$f":"Data!$A$27","v":"DA Mel"},{"$f":"IF(Data!$E$27<>\"\",Data!$E$27)","v":"10:37:00"},{"$f":"IF(B97=FALSE,IF(B96<>FALSE,\"Mål\"),IF(B96<>FALSE,\"4. omgang\"))","v":"4. omgang"},6]
[{"$f":"Data!$A$27","v":"DA Mel"},{"$f":"IF(Data!$F$27<>\"\",Data!$F$27)","v":"10:59:00"},{"$f":"IF(B98=FALSE,IF(B97<>FALSE,\"Mål\"),IF(B97<>FALSE,\"5. omgang\"))","v":"5. omgang"},5]
[{"$f":"Data!$A$27","v":"DA Mel"},{"$f":"IF(Data!$G$27<>\"\",Data!$G$27)","v":"11:20:00"},{"$f":"IF(B99=FALSE,IF(B98<>FALSE,\"Mål\"),IF(B98<>FALSE,\"6. omgang\"))","v":"6. omgang"},4]
[{"$f":"Data!$A$27","v":"DA Mel"},{"$f":"IF(Data!$H$27<>\"\",Data!$H$27)","v":"11:42:00"},{"$f":"IF(B100=FALSE,IF(B99<>FALSE,\"Mål\"),IF(B99<>FALSE,\"7. omgang\"))","v":"7. omgang"},3]
[{"$f":"Data!$A$27","v":"DA Mel"},{"$f":"IF(Data!$I$27<>\"\",Data!$I$27)","v":"12:03:00"},{"$f":"IF(B101=FALSE,IF(B100<>FALSE,\"Mål\"),IF(B100<>FALSE,\"8. omgang\"))","v":"8. omgang"},2]
[{"$f":"Data!$A$27","v":"DA Mel"},{"$f":"IF(Data!$J$27<>\"\",Data!$J$27)","v":"12:24:00"},{"$f":"IF(B102=FALSE,IF(B101<>FALSE,\"Mål\"),IF(B101<>FALSE,\"9. omgang\"))","v":"9. omgang"},1]
[{"$f":"Data!$A$27","v":"DA Mel"},{"$f":"IF(Data!$K$27<>\"\",Data!$K$27)","v":"12:46:00"},{"$f":"IF(B103=FALSE,IF(B102<>FALSE,\"Mål\"),IF(B102<>FALSE,\"10. omgang\"))","v":"Mål"},""]
[{"$f":"Data!$A$27","v":"DA Mel"},{"$f":"IF(Data!$L$27<>\"\",Data!$L$27)","v":false},{"$f":"IF(B104=FALSE,IF(B103<>FALSE,\"Mål\"),IF(B103<>FALSE,\"11. omgang\"))","v":false},false]
[{"$f":"Data!$A$27","v":"DA Mel"},{"$f":"IF(Data!$M$27<>\"\",Data!$M$27)","v":false},{"$f":"IF(B105=FALSE,IF(B104<>FALSE,\"Mål\"),IF(B104<>FALSE,\"12. omgang\"))","v":false},false]
[{"$f":"Data!$A$27","v":"DA Mel"},{"$f":"IF(Data!$N$27<>\"\",Data!$N$27)","v":false},{"$f":"IF(B105=FALSE,IF(B105<>FALSE,\"Mål\"),\"Mål\")","v":false},false]
[{"$f":"Data!$A$30","v":"D Mel"},{"$f":"IF(Data!$B$30<>\"\",Data!$B$30)","v":"09:35:00"},{"$f":"IF(B107=FALSE,IF(B106<>FALSE,\"Mål\"),IF(B106<>FALSE,\"Start\"))","v":"Start"},{"$f":"IF(C106=\"Mål\",\"\",IF(C107=\"Mål\",1,IF(C106<>FALSE,D107+1)))","v":6}]
[{"$f":"Data!$A$30","v":"D Mel"},{"$f":"IF(Data!$C$30<>\"\",Data!$C$30)","v":"09:57:00"},{"$f":"IF(B108=FALSE,IF(B107<>FALSE,\"Mål\"),IF(B107<>FALSE,\"2. omgang\"))","v":"2. omgang"},5]
[{"$f":"Data!$A$30","v":"D Mel"},{"$f":"IF(Data!$D$30<>\"\",Data!$D$30)","v":"10:19:00"},{"$f":"IF(B109=FALSE,IF(B108<>FALSE,\"Mål\"),IF(B108<>FALSE,\"3. omgang\"))","v":"3. omgang"},4]
[{"$f":"Data!$A$30","v":"D Mel"},{"$f":"IF(Data!$E$30<>\"\",Data!$E$30)","v":"10:41:00"},{"$f":"IF(B110=FALSE,IF(B109<>FALSE,\"Mål\"),IF(B109<>FALSE,\"4. omgang\"))","v":"4. omgang"},3]
[{"$f":"Data!$A$30","v":"D Mel"},{"$f":"IF(Data!$F$30<>\"\",Data!$F$30)","v":"11:03:00"},{"$f":"IF(B111=FALSE,IF(B110<>FALSE,\"Mål\"),IF(B110<>FALSE,\"5. omgang\"))","v":"5. omgang"},2]
[{"$f":"Data!$A$30","v":"D Mel"},{"$f":"IF(Data!$G$30<>\"\",Data!$G$30)","v":"11:25:00"},{"$f":"IF(B112=FALSE,IF(B111<>FALSE,\"Mål\"),IF(B111<>FALSE,\"6. omgang\"))","v":"6. omgang"},1]
[{"$f":"Data!$A$30","v":"D Mel"},{"$f":"IF(Data!$H$30<>\"\",Data!$H$30)","v":"11:47:00"},{"$f":"IF(B113=FALSE,IF(B112<>FALSE,\"Mål\"),IF(B112<>FALSE,\"7. omgang\"))","v":"Mål"},""]
[{"$f":"Data!$A$30","v":"D Mel"},{"$f":"IF(Data!$I$30<>\"\",Data!$I$30)","v":false},{"$f":"IF(B114=FALSE,IF(B113<>FALSE,\"Mål\"),IF(B113<>FALSE,\"8. omgang\"))","v":false},false]
[{"$f":"Data!$A$30","v":"D Mel"},{"$f":"IF(Data!$J$30<>\"\",Data!$J$30)","v":false},{"$f":"IF(B115=FALSE,IF(B114<>FALSE,\"Mål\"),IF(B114<>FALSE,\"9. omgang\"))","v":false},false]
[{"$f":"Data!$A$30","v":"D Mel"},{"$f":"IF(Data!$K$30<>\"\",Data!$K$30)","v":false},{"$f":"IF(B116=FALSE,IF(B115<>FALSE,\"Mål\"),IF(B115<>FALSE,\"10. omgang\"))","v":false},false]
[{"$f":"Data!$A$30","v":"D Mel"},{"$f":"IF(Data!$L$30<>\"\",Data!$L$30)","v":false},{"$f":"IF(B117=FALSE,IF(B116<>FALSE,\"Mål\"),IF(B116<>FALSE,\"11. omgang\"))","v":false},false]
[{"$f":"Data!$A$30","v":"D Mel"},{"$f":"IF(Data!$M$30<>\"\",Data!$M$30)","v":false},{"$f":"IF(B118=FALSE,IF(B117<>FALSE,\"Mål\"),IF(B117<>FALSE,\"12. omgang\"))","v":false},false]
[{"$f":"Data!$A$30","v":"D Mel"},{"$f":"IF(Data!$N$30<>\"\",Data!$N$30)","v":false},{"$f":"IF(B118=FALSE,IF(B118<>FALSE,\"Mål\"),\"Mål\")","v":false},false]
[{"$f":"Data!$A$33","v":"H40 Mel"},{"$f":"IF(Data!$B$33<>\"\",Data!$B$33)","v":"12:30:00"},{"$f":"IF(B120=FALSE,IF(B119<>FALSE,\"Mål\"),IF(B119<>FALSE,\"Start\"))","v":"Start"},{"$f":"IF(C119=\"Mål\",\"\",IF(C120=\"Mål\",1,IF(C119<>FALSE,D120+1)))","v":8}]
[{"$f":"Data!$A$33","v":"H40 Mel"},{"$f":"IF(Data!$C$33<>\"\",Data!$C$33)","v":"12:52:00"},{"$f":"IF(B121=FALSE,IF(B120<>FALSE,\"Mål\"),IF(B120<>FALSE,\"2. omgang\"))","v":"2. omgang"},7]
[{"$f":"Data!$A$33","v":"H40 Mel"},{"$f":"IF(Data!$D$33<>\"\",Data!$D$33)","v":"13:14:00"},{"$f":"IF(B122=FALSE,IF(B121<>FALSE,\"Mål\"),IF(B121<>FALSE,\"3. omgang\"))","v":"3. omgang"},6]
[{"$f":"Data!$A$33","v":"H40 Mel"},{"$f":"IF(Data!$E$33<>\"\",Data!$E$33)","v":"13:36:00"},{"$f":"IF(B123=FALSE,IF(B122<>FALSE,\"Mål\"),IF(B122<>FALSE,\"4. omgang\"))","v":"4. omgang"},5]
[{"$f":"Data!$A$33","v":"H40 Mel"},{"$f":"IF(Data!$F$33<>\"\",Data!$F$33)","v":"13:58:00"},{"$f":"IF(B124=FALSE,IF(B123<>FALSE,\"Mål\"),IF(B123<>FALSE,\"5. omgang\"))","v":"5. omgang"},4]
[{"$f":"Data!$A$33","v":"H40 Mel"},{"$f":"IF(Data!$G$33<>\"\",Data!$G$33)","v":"14:20:00"},{"$f":"IF(B125=FALSE,IF(B124<>FALSE,\"Mål\"),IF(B124<>FALSE,\"6. omgang\"))","v":"6. omgang"},3]
[{"$f":"Data!$A$33","v":"H40 Mel"},{"$f":"IF(Data!$H$33<>\"\",Data!$H$33)","v":"14:42:00"},{"$f":"IF(B126=FALSE,IF(B125<>FALSE,\"Mål\"),IF(B125<>FALSE,\"7. omgang\"))","v":"7. omgang"},2]
[{"$f":"Data!$A$33","v":"H40 Mel"},{"$f":"IF(Data!$I$33<>\"\",Data!$I$33)","v":"15:04:00"},{"$f":"IF(B127=FALSE,IF(B126<>FALSE,\"Mål\"),IF(B126<>FALSE,\"8. omgang\"))","v":"8. omgang"},1]
[{"$f":"Data!$A$33","v":"H40 Mel"},{"$f":"IF(Data!$J$33<>\"\",Data!$J$33)","v":"15:26:00"},{"$f":"IF(B128=FALSE,IF(B127<>FALSE,\"Mål\"),IF(B127<>FALSE,\"9. omgang\"))","v":"Mål"},""]
[{"$f":"Data!$A$33","v":"H40 Mel"},{"$f":"IF(Data!$K$33<>\"\",Data!$K$33)","v":false},{"$f":"IF(B129=FALSE,IF(B128<>FALSE,\"Mål\"),IF(B128<>FALSE,\"10. omgang\"))","v":false},false]
[{"$f":"Data!$A$33","v":"H40 Mel"},{"$f":"IF(Data!$L$33<>\"\",Data!$L$33)","v":false},{"$f":"IF(B130=FALSE,IF(B129<>FALSE,\"Mål\"),IF(B129<>FALSE,\"11. omgang\"))","v":false},false]
[{"$f":"Data!$A$33","v":"H40 Mel"},{"$f":"IF(Data!$M$33<>\"\",Data!$M$33)","v":false},{"$f":"IF(B131=FALSE,IF(B130<>FALSE,\"Mål\"),IF(B130<>FALSE,\"12. omgang\"))","v":false},false]
[{"$f":"Data!$A$33","v":"H40 Mel"},{"$f":"IF(Data!$N$33<>\"\",Data!$N$33)","v":false},{"$f":"IF(B131=FALSE,IF(B131<>FALSE,\"Mål\"),\"Mål\")","v":false},false]
[{"$f":"Data!$A$36","v":"H50 Mel"},{"$f":"IF(Data!$B$36<>\"\",Data!$B$36)","v":"12:32:00"},{"$f":"IF(B133=FALSE,IF(B132<>FALSE,\"Mål\"),IF(B132<>FALSE,\"Start\"))","v":"Start"},{"$f":"IF(C132=\"Mål\",\"\",IF(C133=\"Mål\",1,IF(C132<>FALSE,D133+1)))","v":8}]
[{"$f":"Data!$A$36","v":"H50 Mel"},{"$f":"IF(Data!$C$36<>\"\",Data!$C$36)","v":"12:56:00"},{"$f":"IF(B134=FALSE,IF(B133<>FALSE,\"Mål\"),IF(B133<>FALSE,\"2. omgang\"))","v":"2. omgang"},7]
[{"$f":"Data!$A$36","v":"H50 Mel"},{"$f":"IF(Data!$D$36<>\"\",Data!$D$36)","v":"13:19:00"},{"$f":"IF(B135=FALSE,IF(B134<>FALSE,\"Mål\"),IF(B134<>FALSE,\"3. omgang\"))","v":"3. omgang"},6]
[{"$f":"Data!$A$36","v":"H50 Mel"},{"$f":"IF(Data!$E$36<>\"\",Data!$E$36)","v":"13:43:00"},{"$f":"IF(B136=FALSE,IF(B135<>FALSE,\"Mål\"),IF(B135<>FALSE,\"4. omgang\"))","v":"4. omgang"},5]
[{"$f":"Data!$A$36","v":"H50 Mel"},{"$f":"IF(Data!$F$36<>\"\",Data!$F$36)","v":"14:07:00"},{"$f":"IF(B137=FALSE,IF(B136<>FALSE,\"Mål\"),IF(B136<>FALSE,\"5. omgang\"))","v":"5. omgang"},4]
[{"$f":"Data!$A$36","v":"H50 Mel"},{"$f":"IF(Data!$G$36<>\"\",Data!$G$36)","v":"14:30:00"},{"$f":"IF(B138=FALSE,IF(B137<>FALSE,\"Mål\"),IF(B137<>FALSE,\"6. omgang\"))","v":"6. omgang"},3]
[{"$f":"Data!$A$36","v":"H50 Mel"},{"$f":"IF(Data!$H$36<>\"\",Data!$H$36)","v":"14:54:00"},{"$f":"IF(B139=FALSE,IF(B138<>FALSE,\"Mål\"),IF(B138<>FALSE,\"7. omgang\"))","v":"7. omgang"},2]
[{"$f":"Data!$A$36","v":"H50 Mel"},{"$f":"IF(Data!$I$36<>\"\",Data!$I$36)","v":"15:18:00"},{"$f":"IF(B140=FALSE,IF(B139<>FALSE,\"Mål\"),IF(B139<>FALSE,\"8. omgang\"))","v":"8. omgang"},1]
[{"$f":"Data!$A$36","v":"H50 Mel"},{"$f":"IF(Data!$J$36<>\"\",Data!$J$36)","v":"15:41:00"},{"$f":"IF(B141=FALSE,IF(B140<>FALSE,\"Mål\"),IF(B140<>FALSE,\"9. omgang\"))","v":"Mål"},""]
[{"$f":"Data!$A$36","v":"H50 Mel"},{"$f":"IF(Data!$K$36<>\"\",Data!$K$36)","v":false},{"$f":"IF(B142=FALSE,IF(B141<>FALSE,\"Mål\"),IF(B141<>FALSE,\"10. omgang\"))","v":false},false]
[{"$f":"Data!$A$36","v":"H50 Mel"},{"$f":"IF(Data!$L$36<>\"\",Data!$L$36)","v":false},{"$f":"IF(B143=FALSE,IF(B142<>FALSE,\"Mål\"),IF(B142<>FALSE,\"11. omgang\"))","v":false},false]
[{"$f":"Data!$A$36","v":"H50 Mel"},{"$f":"IF(Data!$M$36<>\"\",Data!$M$36)","v":false},{"$f":"IF(B144=FALSE,IF(B143<>FALSE,\"Mål\"),IF(B143<>FALSE,\"12. omgang\"))","v":false},false]
[{"$f":"Data!$A$36","v":"H50 Mel"},{"$f":"IF(Data!$N$36<>\"\",Data!$N$36)","v":false},{"$f":"IF(B144=FALSE,IF(B144<>FALSE,\"Mål\"),\"Mål\")","v":false},false]
[{"$f":"Data!$A$39","v":"H60 Mel"},{"$f":"IF(Data!$B$39<>\"\",Data!$B$39)","v":"12:34:00"},{"$f":"IF(B146=FALSE,IF(B145<>FALSE,\"Mål\"),IF(B145<>FALSE,\"Start\"))","v":"Start"},{"$f":"IF(C145=\"Mål\",\"\",IF(C146=\"Mål\",1,IF(C145<>FALSE,D146+1)))","v":7}]
[{"$f":"Data!$A$39","v":"H60 Mel"},{"$f":"IF(Data!$C$39<>\"\",Data!$C$39)","v":"12:58:00"},{"$f":"IF(B147=FALSE,IF(B146<>FALSE,\"Mål\"),IF(B146<>FALSE,\"2. omgang\"))","v":"2. omgang"},6]
[{"$f":"Data!$A$39","v":"H60 Mel"},{"$f":"IF(Data!$D$39<>\"\",Data!$D$39)","v":"13:23:00"},{"$f":"IF(B148=FALSE,IF(B147<>FALSE,\"Mål\"),IF(B147<>FALSE,\"3. omgang\"))","v":"3. omgang"},5]
[{"$f":"Data!$A$39","v":"H60 Mel"},{"$f":"IF(Data!$E$39<>\"\",Data!$E$39)","v":"13:47:00"},{"$f":"IF(B149=FALSE,IF(B148<>FALSE,\"Mål\"),IF(B148<>FALSE,\"4. omgang\"))","v":"4. omgang"},4]
[{"$f":"Data!$A$39","v":"H60 Mel"},{"$f":"IF(Data!$F$39<>\"\",Data!$F$39)","v":"14:11:00"},{"$f":"IF(B150=FALSE,IF(B149<>FALSE,\"Mål\"),IF(B149<>FALSE,\"5. omgang\"))","v":"5. omgang"},3]
[{"$f":"Data!$A$39","v":"H60 Mel"},{"$f":"IF(Data!$G$39<>\"\",Data!$G$39)","v":"14:36:00"},{"$f":"IF(B151=FALSE,IF(B150<>FALSE,\"Mål\"),IF(B150<>FALSE,\"6. omgang\"))","v":"6. omgang"},2]
[{"$f":"Data!$A$39","v":"H60 Mel"},{"$f":"IF(Data!$H$39<>\"\",Data!$H$39)","v":"15:00:00"},{"$f":"IF(B152=FALSE,IF(B151<>FALSE,\"Mål\"),IF(B151<>FALSE,\"7. omgang\"))","v":"7. omgang"},1]
[{"$f":"Data!$A$39","v":"H60 Mel"},{"$f":"IF(Data!$I$39<>\"\",Data!$I$39)","v":"15:24:00"},{"$f":"IF(B153=FALSE,IF(B152<>FALSE,\"Mål\"),IF(B152<>FALSE,\"8. omgang\"))","v":"Mål"},""]
[{"$f":"Data!$A$39","v":"H60 Mel"},{"$f":"IF(Data!$J$39<>\"\",Data!$J$39)","v":false},{"$f":"IF(B154=FALSE,IF(B153<>FALSE,\"Mål\"),IF(B153<>FALSE,\"9. omgang\"))","v":false},false]
[{"$f":"Data!$A$39","v":"H60 Mel"},{"$f":"IF(Data!$K$39<>\"\",Data!$K$39)","v":false},{"$f":"IF(B155=FALSE,IF(B154<>FALSE,\"Mål\"),IF(B154<>FALSE,\"10. omgang\"))","v":false},false]
[{"$f":"Data!$A$39","v":"H60 Mel"},{"$f":"IF(Data!$L$39<>\"\",Data!$L$39)","v":false},{"$f":"IF(B156=FALSE,IF(B155<>FALSE,\"Mål\"),IF(B155<>FALSE,\"11. omgang\"))","v":false},false]
[{"$f":"Data!$A$39","v":"H60 Mel"},{"$f":"IF(Data!$M$39<>\"\",Data!$M$39)","v":false},{"$f":"IF(B157=FALSE,IF(B156<>FALSE,\"Mål\"),IF(B156<>FALSE,\"12. omgang\"))","v":false},false]
[{"$f":"Data!$A$39","v":"H60 Mel"},{"$f":"IF(Data!$N$39<>\"\",Data!$N$39)","v":false},{"$f":"IF(B157=FALSE,IF(B157<>FALSE,\"Mål\"),\"Mål\")","v":false},false]
[{"$f":"Data!$A$42","v":"H70 Mel"},{"$f":"IF(Data!$B$42<>\"\",Data!$B$42)","v":"12:36:00"},{"$f":"IF(B159=FALSE,IF(B158<>FALSE,\"Mål\"),IF(B158<>FALSE,\"Start\"))","v":"Start"},{"$f":"IF(C158=\"Mål\",\"\",IF(C159=\"Mål\",1,IF(C158<>FALSE,D159+1)))","v":7}]
[{"$f":"Data!$A$42","v":"H70 Mel"},{"$f":"IF(Data!$C$42<>\"\",Data!$C$42)","v":"13:01:00"},{"$f":"IF(B160=FALSE,IF(B159<>FALSE,\"Mål\"),IF(B159<>FALSE,\"2. omgang\"))","v":"2. omgang"},6]
[{"$f":"Data!$A$42","v":"H70 Mel"},{"$f":"IF(Data!$D$42<>\"\",Data!$D$42)","v":"13:26:00"},{"$f":"IF(B161=FALSE,IF(B160<>FALSE,\"Mål\"),IF(B160<>FALSE,\"3. omgang\"))","v":"3. omgang"},5]
[{"$f":"Data!$A$42","v":"H70 Mel"},{"$f":"IF(Data!$E$42<>\"\",Data!$E$42)","v":"13:51:00"},{"$f":"IF(B162=FALSE,IF(B161<>FALSE,\"Mål\"),IF(B161<>FALSE,\"4. omgang\"))","v":"4. omgang"},4]
[{"$f":"Data!$A$42","v":"H70 Mel"},{"$f":"IF(Data!$F$42<>\"\",Data!$F$42)","v":"14:16:00"},{"$f":"IF(B163=FALSE,IF(B162<>FALSE,\"Mål\"),IF(B162<>FALSE,\"5. omgang\"))","v":"5. omgang"},3]
[{"$f":"Data!$A$42","v":"H70 Mel"},{"$f":"IF(Data!$G$42<>\"\",Data!$G$42)","v":"14:41:00"},{"$f":"IF(B164=FALSE,IF(B163<>FALSE,\"Mål\"),IF(B163<>FALSE,\"6. omgang\"))","v":"6. omgang"},2]
[{"$f":"Data!$A$42","v":"H70 Mel"},{"$f":"IF(Data!$H$42<>\"\",Data!$H$42)","v":"15:06:00"},{"$f":"IF(B165=FALSE,IF(B164<>FALSE,\"Mål\"),IF(B164<>FALSE,\"7. omgang\"))","v":"7. omgang"},1]
[{"$f":"Data!$A$42","v":"H70 Mel"},{"$f":"IF(Data!$I$42<>\"\",Data!$I$42)","v":"15:31:00"},{"$f":"IF(B166=FALSE,IF(B165<>FALSE,\"Mål\"),IF(B165<>FALSE,\"8. omgang\"))","v":"Mål"},""]
[{"$f":"Data!$A$42","v":"H70 Mel"},{"$f":"IF(Data!$J$42<>\"\",Data!$J$42)","v":false},{"$f":"IF(B167=FALSE,IF(B166<>FALSE,\"Mål\"),IF(B166<>FALSE,\"9. omgang\"))","v":false},false]
[{"$f":"Data!$A$42","v":"H70 Mel"},{"$f":"IF(Data!$K$42<>\"\",Data!$K$42)","v":false},{"$f":"IF(B168=FALSE,IF(B167<>FALSE,\"Mål\"),IF(B167<>FALSE,\"10. omgang\"))","v":false},false]
[{"$f":"Data!$A$42","v":"H70 Mel"},{"$f":"IF(Data!$L$42<>\"\",Data!$L$42)","v":false},{"$f":"IF(B169=FALSE,IF(B168<>FALSE,\"Mål\"),IF(B168<>FALSE,\"11. omgang\"))","v":false},false]
[{"$f":"Data!$A$42","v":"H70 Mel"},{"$f":"IF(Data!$M$42<>\"\",Data!$M$42)","v":false},{"$f":"IF(B170=FALSE,IF(B169<>FALSE,\"Mål\"),IF(B169<>FALSE,\"12. omgang\"))","v":false},false]
[{"$f":"Data!$A$42","v":"H70 Mel"},{"$f":"IF(Data!$N$42<>\"\",Data!$N$42)","v":false},{"$f":"IF(B170=FALSE,IF(B170<>FALSE,\"Mål\"),\"Mål\")","v":false},false]
[{"$f":"Data!$A$45","v":"A Mel"},{"$f":"IF(Data!$B$45<>\"\",Data!$B$45)","v":"15:15:00"},{"$f":"IF(B172=FALSE,IF(B171<>FALSE,\"Mål\"),IF(B171<>FALSE,\"Start\"))","v":"Start"},12]
[{"$f":"Data!$A$45","v":"A Mel"},{"$f":"IF(Data!$C$45<>\"\",Data!$C$45)","v":"15:35:00"},{"$f":"IF(B173=FALSE,IF(B172<>FALSE,\"Mål\"),IF(B172<>FALSE,\"2. omgang\"))","v":"2. omgang"},11]
[{"$f":"Data!$A$45","v":"A Mel"},{"$f":"IF(Data!$D$45<>\"\",Data!$D$45)","v":"15:55:00"},{"$f":"IF(B174=FALSE,IF(B173<>FALSE,\"Mål\"),IF(B173<>FALSE,\"3. omgang\"))","v":"3. omgang"},10]
[{"$f":"Data!$A$45","v":"A Mel"},{"$f":"IF(Data!$E$45<>\"\",Data!$E$45)","v":"16:15:00"},{"$f":"IF(B175=FALSE,IF(B174<>FALSE,\"Mål\"),IF(B174<>FALSE,\"4. omgang\"))","v":"4. omgang"},9]
[{"$f":"Data!$A$45","v":"A Mel"},{"$f":"IF(Data!$F$45<>\"\",Data!$F$45)","v":"16:35:00"},{"$f":"IF(B176=FALSE,IF(B175<>FALSE,\"Mål\"),IF(B175<>FALSE,\"5. omgang\"))","v":"5. omgang"},8]
[{"$f":"Data!$A$45","v":"A Mel"},{"$f":"IF(Data!$G$45<>\"\",Data!$G$45)","v":"16:55:00"},{"$f":"IF(B177=FALSE,IF(B176<>FALSE,\"Mål\"),IF(B176<>FALSE,\"6. omgang\"))","v":"6. omgang"},7]
[{"$f":"Data!$A$45","v":"A Mel"},{"$f":"IF(Data!$H$45<>\"\",Data!$H$45)","v":"17:15:00"},{"$f":"IF(B178=FALSE,IF(B177<>FALSE,\"Mål\"),IF(B177<>FALSE,\"7. omgang\"))","v":"7. omgang"},6]
[{"$f":"Data!$A$45","v":"A Mel"},{"$f":"IF(Data!$I$45<>\"\",Data!$I$45)","v":"17:35:00"},{"$f":"IF(B179=FALSE,IF(B178<>FALSE,\"Mål\"),IF(B178<>FALSE,\"8. omgang\"))","v":"8. omgang"},5]
[{"$f":"Data!$A$45","v":"A Mel"},{"$f":"IF(Data!$J$45<>\"\",Data!$J$45)","v":"17:55:00"},{"$f":"IF(B180=FALSE,IF(B179<>FALSE,\"Mål\"),IF(B179<>FALSE,\"9. omgang\"))","v":"9. omgang"},4]
[{"$f":"Data!$A$45","v":"A Mel"},{"$f":"IF(Data!$K$45<>\"\",Data!$K$45)","v":"18:15:00"},{"$f":"IF(B181=FALSE,IF(B180<>FALSE,\"Mål\"),IF(B180<>FALSE,\"10. omgang\"))","v":"10. omgang"},3]
[{"$f":"Data!$A$45","v":"A Mel"},{"$f":"IF(Data!$L$45<>\"\",Data!$L$45)","v":"18:35:00"},{"$f":"IF(B182=FALSE,IF(B181<>FALSE,\"Mål\"),IF(B181<>FALSE,\"11. omgang\"))","v":"11. omgang"},2]
[{"$f":"Data!$A$45","v":"A Mel"},{"$f":"IF(Data!$M$45<>\"\",Data!$M$45)","v":"18:55:00"},{"$f":"IF(B183=FALSE,IF(B182<>FALSE,\"Mål\"),IF(B182<>FALSE,\"12. omgang\"))","v":"12. omgang"},1]
[{"$f":"Data!$A$45","v":"A Mel"},{"$f":"IF(Data!$N$45<>\"\",Data!$N$45)","v":"19:15:00"},{"$f":"IF(B183=FALSE,IF(B183<>FALSE,\"Mål\"),\"Mål\")","v":"Mål"},""]
[{"$f":"Data!$A$48","v":"B Mel"},{"$f":"IF(Data!$B$48<>\"\",Data!$B$48)","v":"15:17:00"},{"$f":"IF(B185=FALSE,IF(B184<>FALSE,\"Mål\"),IF(B184<>FALSE,\"Start\"))","v":"Start"},8]
[{"$f":"Data!$A$48","v":"B Mel"},{"$f":"IF(Data!$C$48<>\"\",Data!$C$48)","v":"15:38:00"},{"$f":"IF(B186=FALSE,IF(B185<>FALSE,\"Mål\"),IF(B185<>FALSE,\"2. omgang\"))","v":"2. omgang"},7]
[{"$f":"Data!$A$48","v":"B Mel"},{"$f":"IF(Data!$D$48<>\"\",Data!$D$48)","v":"15:59:00"},{"$f":"IF(B187=FALSE,IF(B186<>FALSE,\"Mål\"),IF(B186<>FALSE,\"3. omgang\"))","v":"3. omgang"},6]
[{"$f":"Data!$A$48","v":"B Mel"},{"$f":"IF(Data!$E$48<>\"\",Data!$E$48)","v":"16:20:00"},{"$f":"IF(B188=FALSE,IF(B187<>FALSE,\"Mål\"),IF(B187<>FALSE,\"4. omgang\"))","v":"4. omgang"},5]
[{"$f":"Data!$A$48","v":"B Mel"},{"$f":"IF(Data!$F$48<>\"\",Data!$F$48)","v":"16:41:00"},{"$f":"IF(B189=FALSE,IF(B188<>FALSE,\"Mål\"),IF(B188<>FALSE,\"5. omgang\"))","v":"5. omgang"},4]
[{"$f":"Data!$A$48","v":"B Mel"},{"$f":"IF(Data!$G$48<>\"\",Data!$G$48)","v":"17:02:00"},{"$f":"IF(B190=FALSE,IF(B189<>FALSE,\"Mål\"),IF(B189<>FALSE,\"6. omgang\"))","v":"6. omgang"},3]
[{"$f":"Data!$A$48","v":"B Mel"},{"$f":"IF(Data!$H$48<>\"\",Data!$H$48)","v":"17:23:00"},{"$f":"IF(B191=FALSE,IF(B190<>FALSE,\"Mål\"),IF(B190<>FALSE,\"7. omgang\"))","v":"7. omgang"},2]
[{"$f":"Data!$A$48","v":"B Mel"},{"$f":"IF(Data!$I$48<>\"\",Data!$I$48)","v":"17:44:00"},{"$f":"IF(B192=FALSE,IF(B191<>FALSE,\"Mål\"),IF(B191<>FALSE,\"8. omgang\"))","v":"8. omgang"},1]
[{"$f":"Data!$A$48","v":"B Mel"},{"$f":"IF(Data!$J$48<>\"\",Data!$J$48)","v":"18:04:00"},{"$f":"IF(B193=FALSE,IF(B192<>FALSE,\"Mål\"),IF(B192<>FALSE,\"9. omgang\"))","v":"Mål"},""]
[{"$f":"Data!$A$48","v":"B Mel"},{"$f":"IF(Data!$K$48<>\"\",Data!$K$48)","v":false},{"$f":"IF(B194=FALSE,IF(B193<>FALSE,\"Mål\"),IF(B193<>FALSE,\"10. omgang\"))","v":false},false]
[{"$f":"Data!$A$48","v":"B Mel"},{"$f":"IF(Data!$L$48<>\"\",Data!$L$48)","v":false},{"$f":"IF(B195=FALSE,IF(B194<>FALSE,\"Mål\"),IF(B194<>FALSE,\"11. omgang\"))","v":false},false]
[{"$f":"Data!$A$48","v":"B Mel"},{"$f":"IF(Data!$M$48<>\"\",Data!$M$48)","v":false},{"$f":"IF(B196=FALSE,IF(B195<>FALSE,\"Mål\"),IF(B195<>FALSE,\"12. omgang\"))","v":false},false]
[{"$f":"Data!$A$48","v":"B Mel"},{"$f":"IF(Data!$N$48<>\"\",Data!$N$48)","v":false},{"$f":"IF(B196=FALSE,IF(B196<>FALSE,\"Mål\"),\"Mål\")","v":false}]
[{"$f":"IF(C197=\"x\",\"\")","v":false}]