{"text_format":"1","workbook":"xlsx","n_sheets":12,"sheets":["Vis Ark","Indtast","Data","Tidsskema","Kopiark","6 omg 7.30-12","6 omg 11.30-16","6 omg 7.30-16","20 omg. 7.30-12","20 omg 11.30-16","20 omg 7.30-16","Tidsskema kopi"],"not_rendered":{"charts":12,"images":9,"macros":1,"external_links":0,"defined_names":6,"comments":0,"pivot_tables":0},"unopened":[{"sheet":"6 omg 7.30-12","index":5,"reason":"not_a_worksheet"},{"sheet":"6 omg 11.30-16","index":6,"reason":"not_a_worksheet"},{"sheet":"6 omg 7.30-16","index":7,"reason":"not_a_worksheet"},{"sheet":"20 omg. 7.30-12","index":8,"reason":"not_a_worksheet"},{"sheet":"20 omg 11.30-16","index":9,"reason":"not_a_worksheet"},{"sheet":"20 omg 7.30-16","index":10,"reason":"not_a_worksheet"}],"bounds":{"document_bytes":16777216,"sheet_cells":100000,"rows_first":2000,"rows_last":500,"rows_between":2000,"halvings":0,"cell_chars":16384,"cell_head_chars":4096},"cells_cut":0,"cells_raw":0,"read":"whole","date_system":"1900"}

{"sheet":"Vis Ark","index":0,"n_rows":9,"n_cols":5,"rows_kept":9,"cut":false,"hidden":true,"merged":[[0,0,0,4],[9,0,11,4],[3,2,3,4]]}
["Vis markerede ark:"]
[]
[]
[]
[null,"Helt ark","7.30-12.00","11.30-16.00","7.30-16.00"]
["Data"]
["Indtast"]
["6 omgange"]
["12 omgange"]

{"sheet":"Indtast","index":1,"n_rows":33,"n_cols":28,"rows_kept":33,"cut":false,"hidden":false,"merged":[[0,2,0,4],[50,0,50,7],[34,0,34,7],[36,0,36,7],[38,0,38,7],[40,0,40,7],[42,0,42,7],[44,0,44,7],[46,0,46,7],[48,0,48,7],[28,0,28,7],[30,0,30,7],[32,0,32,7],[18,0,18,7],[20,0,20,7],[22,0,22,7],[24,0,24,7],[4,0,4,7],[6,0,6,7],[8,0,8,7],[26,0,26,7],[10,0,10,7],[12,0,12,7],[14,0,14,7],[16,0,16,7]]}
["Klasse\nbetegnelser:","Start kl. ","Gennemsnits hastighed",null,null,"Antal omgange","Km. pr omgang","Km. ialt","Km. omgang","Km. omgang","Km. omgang","Km. omgang","Km. omgang","Km. omgang","Km. omgang","Km. omgang","Km. omgang","Km. omgang","Km. omgang","Km. omgang","Km. omgang","Km. omgang","Km. omgang","Km. omgang","Km. omgang","Km. omgang","Km. omgang","Km. omgang"]
[null,null,"Høj","Mel","Lav",null,null,null,1,2,3,4,5,6,7,8,9,10,11,12,13,14,15,16,17,18,19,20]
[]
["U11","08:10:00",31,30,29,1,11,{"$f":"IF($G4<>\"\",$F4*$G4,)","v":11},{"$f":"IF(I$2<=$F4,I$2*$G$4,\"\")","v":11},"","","","","","","","","","","","","","","","","","",""]
["Km. â"]
["U11P","08:10:00",29,28,27,1,11,{"$f":"IF($G6<>\"\",$F6*$G6,)","v":11},{"$f":"IF(I$2<=$F6,I$2*$G$6,\"\")","v":11},{"$f":"IF(J$2<=$F6,J$2*$G$6,\"\")","v":""},"","","","","","","","","","","","","","","","","",""]
["Km. â"]
["U13","08:05:00",32,31,30,2,11,{"$f":"IF($G8<>\"\",$F8*$G8,)","v":22},{"$f":"IF(I$2<=$F8,I$2*$G$8,\"\")","v":11},{"$f":"IF(J$2<=$F8,J$2*$G$8,\"\")","v":22},"","","","","","","","","","","","","","","","","",""]
["Km. â"]
["U13P","08:05:00",31,30,29,2,11,{"$f":"IF($G10<>\"\",$F10*$G10,)","v":22},{"$f":"IF(I$2<=$F10,I$2*$G$10,\"\")","v":11},22,"","","","","","","","","","","","","","","","","",""]
["Km. â"]
["U15","08:00:00",37,36,35,4,11,{"$f":"IF($G12<>\"\",$F12*$G12,)","v":44},{"$f":"IF(I$2<=$F12,I$2*$G$12,\"\")","v":11},22,33,44,"","","","","","","","","","","","","","","",""]
["Km. â"]
["U15P","08:00:00",35,34,33,4,11,{"$f":"IF($G14<>\"\",$F14*$G14,)","v":44},{"$f":"IF(I$2<=$F14,I$2*$G$14,\"\")","v":11},22,33,44,"","","","","","","","","","","","","","","",""]
["Km. â"]
["U17P","08:00:00",35,34,33,4,11,{"$f":"IF($G16<>\"\",$F16*$G16,)","v":44},{"$f":"IF(I$2<=$F16,I$2*$G$16,\"\")","v":11},{"$f":"IF(J$2<=$F16,J$2*$G$16,\"\")","v":22},33,44,"","","","","","","","","","","","","","","",""]
["Km. â"]
["U17","10:00:00",40,39,38,7,11,{"$f":"IF($G18<>\"\",$F18*$G18,)","v":77},{"$f":"IF(I$2<=$F18,I$2*$G$18,\"\")","v":11},{"$f":"IF(J$2<=$F18,J$2*$G$18,\"\")","v":22},33,44,55,66,77,"","","","","","","","","","","","",""]
["Km. â"]
["U19P","10:00:00",37,36,35,6,11,{"$f":"IF($G20<>\"\",$F20*$G20,)","v":66},{"$f":"IF(I$2<=$F20,I$2*$G$20,\"\")","v":11},{"$f":"IF(J$2<=$F20,J$2*$G$20,\"\")","v":22},33,44,55,66,"","","","","","","","","","","","","",""]
["Km. â"]
["A","12:00:00",45,44,43,12,11,{"$f":"IF($G22<>\"\",$F22*$G22,)","v":132},{"$f":"IF(I$2<=$F22,I$2*$G$22,\"\")","v":11},22,33,44,55,66,77,88,99,110,121,132,"","","","","","","",""]
["Km. â"]
["U19","12:07:00",42,41,40,8,11,{"$f":"IF($G24<>\"\",$F24*$G24,)","v":88},{"$f":"IF(I$2<=$F24,I$2*$G24,\"\")","v":11},22,33,44,55,66,77,88,"","","","","","","","","","","",""]
["Km. â"]
["B",null,null,null,null,null,null,{"$f":"IF($G26<>\"\",$F26*$G26,)","v":0},{"$f":"IF(I$2<=$F26,I$2*$G26,\"\")","v":""},"","","","","","","","","","","","","","","","","","",""]
["Km. â"]
["C",null,null,null,null,null,null,{"$f":"IF($G28<>\"\",$F28*$G28,)","v":0},{"$f":"IF(I$2<=$F28,I$2*$G28,\"\")","v":""},"","","","","","","","","","","","","","","","","","",""]
["Km. â"]
["D",null,null,null,null,null,null,{"$f":"IF($G30<>\"\",$F30*$G30,)","v":0},{"$f":"IF(I$2<=$F30,I$2*$G30,\"\")","v":""},"","","","","","","","",{"$f":"IF(R$2<=$F30,R$2*$G30,\"\")","v":""},{"$f":"IF(S$2<=$F30,S$2*$G30,\"\")","v":""},{"$f":"IF(T$2<=$F30,T$2*$G30,\"\")","v":""},{"$f":"IF(U$2<=$F30,U$2*$G30,\"\")","v":""},"","","","","","",""]
["Km. â"]
[null,null,null,null,null,null,null,{"$f":"IF($G32<>\"\",$F32*$G32,)","v":0},{"$f":"IF(I$2<=$F32,I$2*$G32,\"\")","v":""},"","","","","","","","","","","","","","","","","","",""]
["Km. â"]

{"sheet":"Data","index":2,"n_rows":76,"n_cols":24,"rows_kept":76,"cut":false,"hidden":false,"merged":[]}
["Klasse","Start","1. omgang","2. omgang","3. omgang","4. omgang","5. omgang","6. omgang","7. omgang","8. omgang","9. omgang","10. omgang","11. omgang","12. omgang","13. omgang","14. omgang","15. omgang","16. omgang","17. omgang","18. omgang","19. omgang","20. omgang",6.9444445000000005E-4,"Gnms.fart"]
[]
[]
[]
["U15 Lav","08:00:00","08:19:00","08:38:00","08:57:00","09:15:00",null,null,null,null,null,null,null,null,null,null,null,null,null,null,null,null,null,35]
["U15 Mel","08:00:00","08:18:00","08:37:00","08:55:00","09:13:00",null,null,null,null,null,null,null,null,null,null,null,null,null,null,null,null,null,36]
["U15 Høj","08:00:00","08:18:00","08:36:00","08:54:00","09:11:00",null,null,null,null,null,null,null,null,null,null,null,null,null,null,null,null,null,37]
["U17P Lav","08:00:00","08:20:00","08:40:00","09:00:00","09:20:00",null,null,null,null,null,null,null,null,null,null,null,null,null,null,null,null,null,33]
["U17P Mel","08:00:00","08:19:00","08:39:00","08:58:00","09:18:00",null,null,null,null,null,null,null,null,null,null,null,null,null,null,null,null,null,34]
["U17P Høj","08:00:00","08:19:00","08:38:00","08:57:00","09:15:00",null,null,null,null,null,null,null,null,null,null,null,null,null,null,null,null,null,35]
["U15P Lav","08:00:00","08:20:00","08:40:00","09:00:00","09:20:00",null,null,null,null,null,null,null,null,null,null,null,null,null,null,null,null,null,33]
["U15P Mel","08:00:00","08:19:00","08:39:00","08:58:00","09:18:00",null,null,null,null,null,null,null,null,null,null,null,null,null,null,null,null,null,34]
["U15P Høj","08:00:00","08:19:00","08:38:00","08:57:00","09:15:00",null,null,null,null,null,null,null,null,null,null,null,null,null,null,null,null,null,35]
["U13 Lav","08:05:00","08:27:00","08:49:00",null,null,null,null,null,null,null,null,null,null,null,null,null,null,null,null,null,null,null,30]
["U13 Mel","08:05:00","08:26:00","08:48:00",null,null,null,null,null,null,null,null,null,null,null,null,null,null,null,null,null,null,null,31]
["U13 Høj","08:05:00","08:26:00","08:46:00",null,null,null,null,null,null,null,null,null,null,null,null,null,null,null,null,null,null,null,32]
["U13P Lav","08:05:00","08:28:00","08:51:00",null,null,null,null,null,null,null,null,null,null,null,null,null,null,null,null,null,null,null,29]
["U13P Mel","08:05:00","08:27:00","08:49:00",null,null,null,null,null,null,null,null,null,null,null,null,null,null,null,null,null,null,null,30]
["U13P Høj","08:05:00","08:26:00","08:48:00",null,null,null,null,null,null,null,null,null,null,null,null,null,null,null,null,null,null,null,31]
["U11 Lav","08:10:00","08:33:00",null,null,null,null,null,null,null,null,null,null,null,null,null,null,null,null,null,null,null,null,29]
["U11 Mel","08:10:00","08:32:00",null,null,null,null,null,null,null,null,null,null,null,null,null,null,null,null,null,null,null,null,30]
["U11 Høj","08:10:00","08:31:00",null,null,null,null,null,null,null,null,null,null,null,null,null,null,null,null,null,null,null,null,31]
["U11P Lav","08:10:00","08:34:00",null,null,null,null,null,null,null,null,null,null,null,null,null,null,null,null,null,null,null,null,27]
["U11P Mel","08:10:00","08:34:00",null,null,null,null,null,null,null,null,null,null,null,null,null,null,null,null,null,null,null,null,28]
["U11P Høj","08:10:00","08:33:00",null,null,null,null,null,null,null,null,null,null,null,null,null,null,null,null,null,null,null,null,29]
["U19P Lav","10:00:00","10:19:00","10:38:00","10:57:00","11:15:00","11:34:00","11:53:00",null,null,null,null,null,null,null,null,null,null,null,null,null,null,null,35]
["U19P Mel","10:00:00","10:18:00","10:37:00","10:55:00","11:13:00","11:32:00","11:50:00",null,null,null,null,null,null,null,null,null,null,null,null,null,null,null,36]
["U19P Høj","10:00:00","10:18:00","10:36:00","10:54:00","11:11:00","11:29:00","11:47:00",null,null,null,null,null,null,null,null,null,null,null,null,null,null,null,37]
["U17 Lav","10:00:00","10:17:00","10:35:00","10:52:00","11:09:00","11:27:00","11:44:00","12:02:00",null,null,null,null,null,null,null,null,null,null,null,null,null,null,38]
["U17 Mel","10:00:00","10:17:00","10:34:00","10:51:00","11:08:00","11:25:00","11:42:00","11:58:00",null,null,null,null,null,null,null,null,null,null,null,null,null,null,39]
["U17 Høj","10:00:00","10:17:00","10:33:00","10:50:00","11:06:00","11:23:00","11:39:00","11:56:00",null,null,null,null,null,null,null,null,null,null,null,null,null,null,40]
["A Lav","12:00:00","12:15:00","12:31:00","12:46:00","13:01:00","13:17:00","13:32:00","13:47:00","14:03:00","14:18:00","14:33:00","14:49:00","15:04:00",null,null,null,null,null,null,null,null,null,43]
["A Mel","12:00:00","12:15:00","12:30:00","12:45:00","13:00:00","13:15:00","13:30:00","13:45:00","14:00:00","14:15:00","14:30:00","14:45:00","15:00:00",null,null,null,null,null,null,null,null,null,44]
["A Høj","12:00:00","12:15:00","12:29:00","12:44:00","12:59:00","13:13:00","13:28:00","13:43:00","13:57:00","14:12:00","14:27:00","14:41:00","14:56:00",null,null,null,null,null,null,null,null,null,45]
["U19 Lav","12:07:00","12:24:00","12:40:00","12:57:00","13:13:00","13:30:00","13:46:00","14:03:00","14:19:00",null,null,null,null,null,null,null,null,null,null,null,null,null,40]
["U19 Mel","12:07:00","12:23:00","12:39:00","12:55:00","13:11:00","13:27:00","13:44:00","14:00:00","14:16:00",null,null,null,null,null,null,null,null,null,null,null,null,null,41]
["U19 Høj","12:07:00","12:23:00","12:38:00","12:54:00","13:10:00","13:26:00","13:41:00","13:57:00","14:13:00",null,null,null,null,null,null,null,null,null,null,null,null,null,42]
["D Lav","",null,null,null,null,null,null,null,null,null,null,null,null,null,null,null,null,null,null,null,null,null,0]
["D Mel","",null,null,null,null,null,null,null,null,null,null,null,null,null,null,null,null,null,null,null,null,null,0]
["D Høj","",null,null,null,null,null,null,null,null,null,null,null,null,null,null,null,null,null,null,null,null,null,0]
["B Lav","",null,null,null,null,null,null,null,null,null,null,null,null,null,null,null,null,null,null,null,null,null,0]
["B Mel","",null,null,null,null,null,null,null,null,null,null,null,null,null,null,null,null,null,null,null,null,null,0]
["B Høj","",null,null,null,null,null,null,null,null,null,null,null,null,null,null,null,null,null,null,null,null,null,0]
["C Lav","",null,null,null,null,null,null,null,null,null,null,null,null,null,null,null,null,null,null,null,null,null,0]
["C Mel","",null,null,null,null,null,null,null,null,null,null,null,null,null,null,null,null,null,null,null,null,null,0]
["C Høj","",null,null,null,null,null,null,null,null,null,null,null,null,null,null,null,null,null,null,null,null,null,0]
[null,"",null,null,null,null,null,null,null,null,null,null,null,null,null,null,null,null,null,null,null,null,null,0]
[null,"",null,null,null,null,null,null,null,null,null,null,null,null,null,null,null,null,null,null,null,null,null,0]
[null,"",null,null,null,null,null,null,null,null,null,null,null,null,null,null,null,null,null,null,null,null,null,0]
[null,""]
[null,""]
[null,""]
[null,""]
[null,""]
[null,""]
[null,""]
[null,""]
[null,""]
[null,""]
[null,""]
[null,""]
[null,""]
[null,""]
[null,""]
[null,""]
[null,""]
[null,""]
[null,""]
[null,""]
[null,""]
[null,""]
[null,""]
[null,""]
[null,""]
[null,""]
[null,""]

{"sheet":"Tidsskema","index":3,"n_rows":63,"n_cols":13,"rows_kept":63,"cut":false,"hidden":false,"merged":[]}
["Klasse","Forventet kl.",null,"Resterende omgange","Førerbil 1","Førerbil 2","Kommissær 1","Kommissær 2","Kommissær 3","Slutbil","Kanal","Andet","Faktisk tid"]
["U15","08:00:00","Start",4]
["U17P","08:00:00","Start",4]
["U15P","08:00:00","Start",4]
["U13","08:05:00","Start",2]
["U13P","08:05:00","Start",2]
["U11","08:10:00","Start",1]
["U11P","08:10:00","Start",1]
["U15","08:18:00","2. omgang",3]
["U17P","08:19:00","2. omgang",3]
["U15P","08:19:00","2. omgang",3]
["U13","08:26:00","2. omgang",1]
["U13P","08:27:00","2. omgang",1]
["U11","08:32:00","Mål",""]
["U11P","08:34:00","Mål",""]
["U15","08:37:00","3. omgang",2]
["U17P","08:39:00","3. omgang",2]
["U15P","08:39:00","3. omgang",2]
["U13","08:48:00","Mål",""]
["U13P","08:49:00","Mål",""]
["U15","08:55:00","4. omgang",1]
["U17P","08:58:00","4. omgang",1]
["U15P","08:58:00","4. omgang",1]
["U15","09:13:00","Mål",""]
["U17P","09:18:00","Mål",""]
["U15P","09:18:00","Mål",""]
["U19P","10:00:00","Start",6]
["U17","10:00:00","Start",7]
["U17","10:17:00","2. omgang",6]
["U19P","10:18:00","2. omgang",5]
["U17","10:34:00","3. omgang",5]
["U19P","10:37:00","3. omgang",4]
["U17","10:51:00","4. omgang",4]
["U19P","10:55:00","4. omgang",3]
["U17","11:08:00","5. omgang",3]
["U19P","11:13:00","5. omgang",2]
["U17","11:25:00","6. omgang",2]
["U19P","11:32:00","6. omgang",1]
["U17","11:42:00","7. omgang",1]
["U19P","11:50:00","Mål",""]
["U17","11:58:00","Mål",""]
["A","12:00:00","Start",12]
["U19","12:07:00","Start",8]
["A","12:15:00","2. omgang",11]
["U19","12:23:00","2. omgang",7]
["A","12:30:00","3. omgang",10]
["U19","12:39:00","3. omgang",6]
["A","12:45:00","4. omgang",9]
["U19","12:55:00","4. omgang",5]
["A","13:00:00","5. omgang",8]
["U19","13:11:00","5. omgang",4]
["A","13:15:00","6. omgang",7]
["U19","13:27:00","6. omgang",3]
["A","13:30:00","7. omgang",6]
["U19","13:44:00","7. omgang",2]
["A","13:45:00","8. omgang",5]
["U19","14:00:00","8. omgang",1]
["A","14:00:00","9. omgang",4]
["A","14:15:00","10. omgang",3]
["U19","14:16:00","Mål",""]
["A","14:30:00","11. omgang",2]
["A","14:45:00","12. omgang",1]
["A","15:00:00","Mål",""]

{"sheet":"Kopiark","index":4,"n_rows":49,"n_cols":24,"rows_kept":49,"cut":false,"hidden":true,"merged":[]}
["Klasse","Start","1. omgang","2. omgang","3. omgang","4. omgang","5. omgang","6. omgang","7. omgang","8. omgang","9. omgang","10. omgang","11. omgang","12. omgang","13. omgang","14. omgang","15. omgang","16. omgang","17. omgang","18. omgang","19. omgang","20. omgang",6.9444445000000005E-4,"Gnms.fart"]
[]
[]
[]
[{"$f":"Indtast!$A12&\" \"&Indtast!$E$2","v":"U15 Lav"},{"$f":"IF(Indtast!$B$12<>\"\",Indtast!$B$12,\"\")","v":"08:00:00"},{"$f":"IF(Indtast!I12<>\"\",ROUND((60/$X5*Indtast!I$12),0)*$W$1+$B5,IF(Indtast!I13<>\"\",ROUND((60/$X5*Indtast!I$13),0)*$W$1+$B5,\"x\"))","v":"08:19:00"},{"$f":"IF(Indtast!J12<>\"\",ROUND((60/$X5*Indtast!J$12),0)*$W$1+$B5,IF(Indtast!J13<>\"\",ROUND((60/$X5*Indtast!J$13),0)*$W$1+$B5,\"x\"))","v":"08:38:00"},{"$f":"IF(Indtast!K12<>\"\",ROUND((60/$X5*Indtast!K$12),0)*$W$1+$B5,IF(Indtast!K13<>\"\",ROUND((60/$X5*Indtast!K$13),0)*$W$1+$B5,\"x\"))","v":"08:57:00"},{"$f":"IF(Indtast!L12<>\"\",ROUND((60/$X5*Indtast!L$12),0)*$W$1+$B5,IF(Indtast!L13<>\"\",ROUND((60/$X5*Indtast!L$13),0)*$W$1+$B5,\"x\"))","v":"09:15:00"},{"$f":"IF(Indtast!M12<>\"\",ROUND((60/$X5*Indtast!M$12),0)*$W$1+$B5,IF(Indtast!M13<>\"\",ROUND((60/$X5*Indtast!M$13),0)*$W$1+$B5,\"x\"))","v":"x"},{"$f":"IF(Indtast!N12<>\"\",ROUND((60/$X5*Indtast!N$12),0)*$W$1+$B5,IF(Indtast!N13<>\"\",ROUND((60/$X5*Indtast!N$13),0)*$W$1+$B5,\"x\"))","v":"x"},{"$f":"IF(Indtast!O12<>\"\",ROUND((60/$X5*Indtast!O$12),0)*$W$1+$B5,IF(Indtast!O13<>\"\",ROUND((60/$X5*Indtast!O$13),0)*$W$1+$B5,\"x\"))","v":"x"},{"$f":"IF(Indtast!P12<>\"\",ROUND((60/$X5*Indtast!P$12),0)*$W$1+$B5,IF(Indtast!P13<>\"\",ROUND((60/$X5*Indtast!P$13),0)*$W$1+$B5,\"x\"))","v":"x"},{"$f":"IF(Indtast!Q12<>\"\",ROUND((60/$X5*Indtast!Q$12),0)*$W$1+$B5,IF(Indtast!Q13<>\"\",ROUND((60/$X5*Indtast!Q$13),0)*$W$1+$B5,\"x\"))","v":"x"},{"$f":"IF(Indtast!R12<>\"\",ROUND((60/$X5*Indtast!R$12),0)*$W$1+$B5,IF(Indtast!R13<>\"\",ROUND((60/$X5*Indtast!R$13),0)*$W$1+$B5,\"x\"))","v":"x"},{"$f":"IF(Indtast!S12<>\"\",ROUND((60/$X5*Indtast!S$12),0)*$W$1+$B5,IF(Indtast!S13<>\"\",ROUND((60/$X5*Indtast!S$13),0)*$W$1+$B5,\"x\"))","v":"x"},{"$f":"IF(Indtast!T12<>\"\",ROUND((60/$X5*Indtast!T$12),0)*$W$1+$B5,IF(Indtast!T13<>\"\",ROUND((60/$X5*Indtast!T$13),0)*$W$1+$B5,\"x\"))","v":"x"},{"$f":"IF(Indtast!U12<>\"\",ROUND((60/$X5*Indtast!U$12),0)*$W$1+$B5,IF(Indtast!U13<>\"\",ROUND((60/$X5*Indtast!U$13),0)*$W$1+$B5,\"x\"))","v":"x"},{"$f":"IF(Indtast!V12<>\"\",ROUND((60/$X5*Indtast!V$12),0)*$W$1+$B5,IF(Indtast!V13<>\"\",ROUND((60/$X5*Indtast!V$13),0)*$W$1+$B5,\"x\"))","v":"x"},{"$f":"IF(Indtast!W12<>\"\",ROUND((60/$X5*Indtast!W$12),0)*$W$1+$B5,IF(Indtast!W13<>\"\",ROUND((60/$X5*Indtast!W$13),0)*$W$1+$B5,\"x\"))","v":"x"},{"$f":"IF(Indtast!X12<>\"\",ROUND((60/$X5*Indtast!X$12),0)*$W$1+$B5,IF(Indtast!X13<>\"\",ROUND((60/$X5*Indtast!X$13),0)*$W$1+$B5,\"x\"))","v":"x"},{"$f":"IF(Indtast!Y12<>\"\",ROUND((60/$X5*Indtast!Y$12),0)*$W$1+$B5,IF(Indtast!Y13<>\"\",ROUND((60/$X5*Indtast!Y$13),0)*$W$1+$B5,\"x\"))","v":"x"},{"$f":"IF(Indtast!Z12<>\"\",ROUND((60/$X5*Indtast!Z$12),0)*$W$1+$B5,IF(Indtast!Z13<>\"\",ROUND((60/$X5*Indtast!Z$13),0)*$W$1+$B5,\"x\"))","v":"x"},{"$f":"IF(Indtast!AA12<>\"\",ROUND((60/$X5*Indtast!AA$12),0)*$W$1+$B5,IF(Indtast!AA13<>\"\",ROUND((60/$X5*Indtast!AA$13),0)*$W$1+$B5,\"x\"))","v":"x"},{"$f":"IF(Indtast!AB12<>\"\",ROUND((60/$X5*Indtast!AB$12),0)*$W$1+$B5,IF(Indtast!AB13<>\"\",ROUND((60/$X5*Indtast!AB$13),0)*$W$1+$B5,\"x\"))","v":"x"},null,{"$f":"Indtast!$E$12","v":35}]
[{"$f":"Indtast!A12&\" \"&Indtast!$D$2","v":"U15 Mel"},{"$f":"IF(Indtast!$B$12<>\"\",Indtast!$B$12,\"\")","v":"08:00:00"},{"$f":"IF(Indtast!I12<>\"\",ROUND((60/$X6*Indtast!I$12),0)*$W$1+$B6,IF(Indtast!I13<>\"\",ROUND((60/$X6*Indtast!I$13),0)*$W$1+$B6,\"x\"))","v":"08:18:00"},{"$f":"IF(Indtast!J12<>\"\",ROUND((60/$X6*Indtast!J$12),0)*$W$1+$B6,IF(Indtast!J13<>\"\",ROUND((60/$X6*Indtast!J$13),0)*$W$1+$B6,\"x\"))","v":"08:37:00"},{"$f":"IF(Indtast!K12<>\"\",ROUND((60/$X6*Indtast!K$12),0)*$W$1+$B6,IF(Indtast!K13<>\"\",ROUND((60/$X6*Indtast!K$13),0)*$W$1+$B6,\"x\"))","v":"08:55:00"},{"$f":"IF(Indtast!L12<>\"\",ROUND((60/$X6*Indtast!L$12),0)*$W$1+$B6,IF(Indtast!L13<>\"\",ROUND((60/$X6*Indtast!L$13),0)*$W$1+$B6,\"x\"))","v":"09:13:00"},{"$f":"IF(Indtast!M12<>\"\",ROUND((60/$X6*Indtast!M$12),0)*$W$1+$B6,IF(Indtast!M13<>\"\",ROUND((60/$X6*Indtast!M$13),0)*$W$1+$B6,\"x\"))","v":"x"},{"$f":"IF(Indtast!N12<>\"\",ROUND((60/$X6*Indtast!N$12),0)*$W$1+$B6,IF(Indtast!N13<>\"\",ROUND((60/$X6*Indtast!N$13),0)*$W$1+$B6,\"x\"))","v":"x"},{"$f":"IF(Indtast!O12<>\"\",ROUND((60/$X6*Indtast!O$12),0)*$W$1+$B6,IF(Indtast!O13<>\"\",ROUND((60/$X6*Indtast!O$13),0)*$W$1+$B6,\"x\"))","v":"x"},{"$f":"IF(Indtast!P12<>\"\",ROUND((60/$X6*Indtast!P$12),0)*$W$1+$B6,IF(Indtast!P13<>\"\",ROUND((60/$X6*Indtast!P$13),0)*$W$1+$B6,\"x\"))","v":"x"},{"$f":"IF(Indtast!Q12<>\"\",ROUND((60/$X6*Indtast!Q$12),0)*$W$1+$B6,IF(Indtast!Q13<>\"\",ROUND((60/$X6*Indtast!Q$13),0)*$W$1+$B6,\"x\"))","v":"x"},{"$f":"IF(Indtast!R12<>\"\",ROUND((60/$X6*Indtast!R$12),0)*$W$1+$B6,IF(Indtast!R13<>\"\",ROUND((60/$X6*Indtast!R$13),0)*$W$1+$B6,\"x\"))","v":"x"},{"$f":"IF(Indtast!S12<>\"\",ROUND((60/$X6*Indtast!S$12),0)*$W$1+$B6,IF(Indtast!S13<>\"\",ROUND((60/$X6*Indtast!S$13),0)*$W$1+$B6,\"x\"))","v":"x"},{"$f":"IF(Indtast!T12<>\"\",ROUND((60/$X6*Indtast!T$12),0)*$W$1+$B6,IF(Indtast!T13<>\"\",ROUND((60/$X6*Indtast!T$13),0)*$W$1+$B6,\"x\"))","v":"x"},{"$f":"IF(Indtast!U12<>\"\",ROUND((60/$X6*Indtast!U$12),0)*$W$1+$B6,IF(Indtast!U13<>\"\",ROUND((60/$X6*Indtast!U$13),0)*$W$1+$B6,\"x\"))","v":"x"},{"$f":"IF(Indtast!V12<>\"\",ROUND((60/$X6*Indtast!V$12),0)*$W$1+$B6,IF(Indtast!V13<>\"\",ROUND((60/$X6*Indtast!V$13),0)*$W$1+$B6,\"x\"))","v":"x"},{"$f":"IF(Indtast!W12<>\"\",ROUND((60/$X6*Indtast!W$12),0)*$W$1+$B6,IF(Indtast!W13<>\"\",ROUND((60/$X6*Indtast!W$13),0)*$W$1+$B6,\"x\"))","v":"x"},{"$f":"IF(Indtast!X12<>\"\",ROUND((60/$X6*Indtast!X$12),0)*$W$1+$B6,IF(Indtast!X13<>\"\",ROUND((60/$X6*Indtast!X$13),0)*$W$1+$B6,\"x\"))","v":"x"},{"$f":"IF(Indtast!Y12<>\"\",ROUND((60/$X6*Indtast!Y$12),0)*$W$1+$B6,IF(Indtast!Y13<>\"\",ROUND((60/$X6*Indtast!Y$13),0)*$W$1+$B6,\"x\"))","v":"x"},{"$f":"IF(Indtast!Z12<>\"\",ROUND((60/$X6*Indtast!Z$12),0)*$W$1+$B6,IF(Indtast!Z13<>\"\",ROUND((60/$X6*Indtast!Z$13),0)*$W$1+$B6,\"x\"))","v":"x"},{"$f":"IF(Indtast!AA12<>\"\",ROUND((60/$X6*Indtast!AA$12),0)*$W$1+$B6,IF(Indtast!AA13<>\"\",ROUND((60/$X6*Indtast!AA$13),0)*$W$1+$B6,\"x\"))","v":"x"},{"$f":"IF(Indtast!AB12<>\"\",ROUND((60/$X6*Indtast!AB$12),0)*$W$1+$B6,IF(Indtast!AB13<>\"\",ROUND((60/$X6*Indtast!AB$13),0)*$W$1+$B6,\"x\"))","v":"x"},null,{"$f":"Indtast!$D$12","v":36}]
[{"$f":"Indtast!A12&\" \"&Indtast!$C$2","v":"U15 Høj"},{"$f":"IF(Indtast!$B$12<>\"\",Indtast!$B$12,\"\")","v":"08:00:00"},{"$f":"IF(Indtast!I12<>\"\",ROUND((60/$X7*Indtast!I$12),0)*$W$1+$B7,IF(Indtast!I13<>\"\",ROUND((60/$X7*Indtast!I$13),0)*$W$1+$B7,\"x\"))","v":"08:18:00"},{"$f":"IF(Indtast!J12<>\"\",ROUND((60/$X7*Indtast!J$12),0)*$W$1+$B7,IF(Indtast!J13<>\"\",ROUND((60/$X7*Indtast!J$13),0)*$W$1+$B7,\"x\"))","v":"08:36:00"},{"$f":"IF(Indtast!K12<>\"\",ROUND((60/$X7*Indtast!K$12),0)*$W$1+$B7,IF(Indtast!K13<>\"\",ROUND((60/$X7*Indtast!K$13),0)*$W$1+$B7,\"x\"))","v":"08:54:00"},{"$f":"IF(Indtast!L12<>\"\",ROUND((60/$X7*Indtast!L$12),0)*$W$1+$B7,IF(Indtast!L13<>\"\",ROUND((60/$X7*Indtast!L$13),0)*$W$1+$B7,\"x\"))","v":"09:11:00"},{"$f":"IF(Indtast!M12<>\"\",ROUND((60/$X7*Indtast!M$12),0)*$W$1+$B7,IF(Indtast!M13<>\"\",ROUND((60/$X7*Indtast!M$13),0)*$W$1+$B7,\"x\"))","v":"x"},{"$f":"IF(Indtast!N12<>\"\",ROUND((60/$X7*Indtast!N$12),0)*$W$1+$B7,IF(Indtast!N13<>\"\",ROUND((60/$X7*Indtast!N$13),0)*$W$1+$B7,\"x\"))","v":"x"},{"$f":"IF(Indtast!O12<>\"\",ROUND((60/$X7*Indtast!O$12),0)*$W$1+$B7,IF(Indtast!O13<>\"\",ROUND((60/$X7*Indtast!O$13),0)*$W$1+$B7,\"x\"))","v":"x"},{"$f":"IF(Indtast!P12<>\"\",ROUND((60/$X7*Indtast!P$12),0)*$W$1+$B7,IF(Indtast!P13<>\"\",ROUND((60/$X7*Indtast!P$13),0)*$W$1+$B7,\"x\"))","v":"x"},{"$f":"IF(Indtast!Q12<>\"\",ROUND((60/$X7*Indtast!Q$12),0)*$W$1+$B7,IF(Indtast!Q13<>\"\",ROUND((60/$X7*Indtast!Q$13),0)*$W$1+$B7,\"x\"))","v":"x"},{"$f":"IF(Indtast!R12<>\"\",ROUND((60/$X7*Indtast!R$12),0)*$W$1+$B7,IF(Indtast!R13<>\"\",ROUND((60/$X7*Indtast!R$13),0)*$W$1+$B7,\"x\"))","v":"x"},{"$f":"IF(Indtast!S12<>\"\",ROUND((60/$X7*Indtast!S$12),0)*$W$1+$B7,IF(Indtast!S13<>\"\",ROUND((60/$X7*Indtast!S$13),0)*$W$1+$B7,\"x\"))","v":"x"},{"$f":"IF(Indtast!T12<>\"\",ROUND((60/$X7*Indtast!T$12),0)*$W$1+$B7,IF(Indtast!T13<>\"\",ROUND((60/$X7*Indtast!T$13),0)*$W$1+$B7,\"x\"))","v":"x"},{"$f":"IF(Indtast!U12<>\"\",ROUND((60/$X7*Indtast!U$12),0)*$W$1+$B7,IF(Indtast!U13<>\"\",ROUND((60/$X7*Indtast!U$13),0)*$W$1+$B7,\"x\"))","v":"x"},{"$f":"IF(Indtast!V12<>\"\",ROUND((60/$X7*Indtast!V$12),0)*$W$1+$B7,IF(Indtast!V13<>\"\",ROUND((60/$X7*Indtast!V$13),0)*$W$1+$B7,\"x\"))","v":"x"},{"$f":"IF(Indtast!W12<>\"\",ROUND((60/$X7*Indtast!W$12),0)*$W$1+$B7,IF(Indtast!W13<>\"\",ROUND((60/$X7*Indtast!W$13),0)*$W$1+$B7,\"x\"))","v":"x"},{"$f":"IF(Indtast!X12<>\"\",ROUND((60/$X7*Indtast!X$12),0)*$W$1+$B7,IF(Indtast!X13<>\"\",ROUND((60/$X7*Indtast!X$13),0)*$W$1+$B7,\"x\"))","v":"x"},{"$f":"IF(Indtast!Y12<>\"\",ROUND((60/$X7*Indtast!Y$12),0)*$W$1+$B7,IF(Indtast!Y13<>\"\",ROUND((60/$X7*Indtast!Y$13),0)*$W$1+$B7,\"x\"))","v":"x"},{"$f":"IF(Indtast!Z12<>\"\",ROUND((60/$X7*Indtast!Z$12),0)*$W$1+$B7,IF(Indtast!Z13<>\"\",ROUND((60/$X7*Indtast!Z$13),0)*$W$1+$B7,\"x\"))","v":"x"},{"$f":"IF(Indtast!AA12<>\"\",ROUND((60/$X7*Indtast!AA$12),0)*$W$1+$B7,IF(Indtast!AA13<>\"\",ROUND((60/$X7*Indtast!AA$13),0)*$W$1+$B7,\"x\"))","v":"x"},{"$f":"IF(Indtast!AB12<>\"\",ROUND((60/$X7*Indtast!AB$12),0)*$W$1+$B7,IF(Indtast!AB13<>\"\",ROUND((60/$X7*Indtast!AB$13),0)*$W$1+$B7,\"x\"))","v":"x"},null,{"$f":"Indtast!$C$12","v":37}]
[{"$f":"Indtast!$A16&\" \"&Indtast!$E$2","v":"U17P Lav"},{"$f":"IF(Indtast!$B$16<>\"\",Indtast!$B$16,\"\")","v":"08:00:00"},{"$f":"IF(Indtast!I16<>\"\",ROUND((60/$X8*Indtast!I$16),0)*$W$1+$B8,IF(Indtast!I17<>\"\",ROUND((60/$X8*Indtast!I$17),0)*$W$1+$B8,\"x\"))","v":"08:20:00"},{"$f":"IF(Indtast!J16<>\"\",ROUND((60/$X8*Indtast!J$16),0)*$W$1+$B8,IF(Indtast!J17<>\"\",ROUND((60/$X8*Indtast!J$17),0)*$W$1+$B8,\"x\"))","v":"08:40:00"},{"$f":"IF(Indtast!K16<>\"\",ROUND((60/$X8*Indtast!K$16),0)*$W$1+$B8,IF(Indtast!K17<>\"\",ROUND((60/$X8*Indtast!K$17),0)*$W$1+$B8,\"x\"))","v":"09:00:00"},{"$f":"IF(Indtast!L16<>\"\",ROUND((60/$X8*Indtast!L$16),0)*$W$1+$B8,IF(Indtast!L17<>\"\",ROUND((60/$X8*Indtast!L$17),0)*$W$1+$B8,\"x\"))","v":"09:20:00"},{"$f":"IF(Indtast!M16<>\"\",ROUND((60/$X8*Indtast!M$16),0)*$W$1+$B8,IF(Indtast!M17<>\"\",ROUND((60/$X8*Indtast!M$17),0)*$W$1+$B8,\"x\"))","v":"x"},{"$f":"IF(Indtast!N16<>\"\",ROUND((60/$X8*Indtast!N$16),0)*$W$1+$B8,IF(Indtast!N17<>\"\",ROUND((60/$X8*Indtast!N$17),0)*$W$1+$B8,\"x\"))","v":"x"},{"$f":"IF(Indtast!O16<>\"\",ROUND((60/$X8*Indtast!O$16),0)*$W$1+$B8,IF(Indtast!O17<>\"\",ROUND((60/$X8*Indtast!O$17),0)*$W$1+$B8,\"x\"))","v":"x"},{"$f":"IF(Indtast!P16<>\"\",ROUND((60/$X8*Indtast!P$16),0)*$W$1+$B8,IF(Indtast!P17<>\"\",ROUND((60/$X8*Indtast!P$17),0)*$W$1+$B8,\"x\"))","v":"x"},{"$f":"IF(Indtast!Q16<>\"\",ROUND((60/$X8*Indtast!Q$16),0)*$W$1+$B8,IF(Indtast!Q17<>\"\",ROUND((60/$X8*Indtast!Q$17),0)*$W$1+$B8,\"x\"))","v":"x"},{"$f":"IF(Indtast!R16<>\"\",ROUND((60/$X8*Indtast!R$16),0)*$W$1+$B8,IF(Indtast!R17<>\"\",ROUND((60/$X8*Indtast!R$17),0)*$W$1+$B8,\"x\"))","v":"x"},{"$f":"IF(Indtast!S16<>\"\",ROUND((60/$X8*Indtast!S$16),0)*$W$1+$B8,IF(Indtast!S17<>\"\",ROUND((60/$X8*Indtast!S$17),0)*$W$1+$B8,\"x\"))","v":"x"},{"$f":"IF(Indtast!T16<>\"\",ROUND((60/$X8*Indtast!T$16),0)*$W$1+$B8,IF(Indtast!T17<>\"\",ROUND((60/$X8*Indtast!T$17),0)*$W$1+$B8,\"x\"))","v":"x"},{"$f":"IF(Indtast!U16<>\"\",ROUND((60/$X8*Indtast!U$16),0)*$W$1+$B8,IF(Indtast!U17<>\"\",ROUND((60/$X8*Indtast!U$17),0)*$W$1+$B8,\"x\"))","v":"x"},{"$f":"IF(Indtast!V16<>\"\",ROUND((60/$X8*Indtast!V$16),0)*$W$1+$B8,IF(Indtast!V17<>\"\",ROUND((60/$X8*Indtast!V$17),0)*$W$1+$B8,\"x\"))","v":"x"},{"$f":"IF(Indtast!W16<>\"\",ROUND((60/$X8*Indtast!W$16),0)*$W$1+$B8,IF(Indtast!W17<>\"\",ROUND((60/$X8*Indtast!W$17),0)*$W$1+$B8,\"x\"))","v":"x"},{"$f":"IF(Indtast!X16<>\"\",ROUND((60/$X8*Indtast!X$16),0)*$W$1+$B8,IF(Indtast!X17<>\"\",ROUND((60/$X8*Indtast!X$17),0)*$W$1+$B8,\"x\"))","v":"x"},{"$f":"IF(Indtast!Y16<>\"\",ROUND((60/$X8*Indtast!Y$16),0)*$W$1+$B8,IF(Indtast!Y17<>\"\",ROUND((60/$X8*Indtast!Y$17),0)*$W$1+$B8,\"x\"))","v":"x"},{"$f":"IF(Indtast!Z16<>\"\",ROUND((60/$X8*Indtast!Z$16),0)*$W$1+$B8,IF(Indtast!Z17<>\"\",ROUND((60/$X8*Indtast!Z$17),0)*$W$1+$B8,\"x\"))","v":"x"},{"$f":"IF(Indtast!AA16<>\"\",ROUND((60/$X8*Indtast!AA$16),0)*$W$1+$B8,IF(Indtast!AA17<>\"\",ROUND((60/$X8*Indtast!AA$17),0)*$W$1+$B8,\"x\"))","v":"x"},{"$f":"IF(Indtast!AB16<>\"\",ROUND((60/$X8*Indtast!AB$16),0)*$W$1+$B8,IF(Indtast!AB17<>\"\",ROUND((60/$X8*Indtast!AB$17),0)*$W$1+$B8,\"x\"))","v":"x"},null,{"$f":"Indtast!$E$16","v":33}]
[{"$f":"Indtast!A16&\" \"&Indtast!$D$2","v":"U17P Mel"},{"$f":"IF(Indtast!$B$16<>\"\",Indtast!$B$16,\"\")","v":"08:00:00"},{"$f":"IF(Indtast!I16<>\"\",ROUND((60/$X9*Indtast!I$16),0)*$W$1+$B9,IF(Indtast!I17<>\"\",ROUND((60/$X9*Indtast!I$17),0)*$W$1+$B9,\"x\"))","v":"08:19:00"},{"$f":"IF(Indtast!J16<>\"\",ROUND((60/$X9*Indtast!J$16),0)*$W$1+$B9,IF(Indtast!J17<>\"\",ROUND((60/$X9*Indtast!J$17),0)*$W$1+$B9,\"x\"))","v":"08:39:00"},{"$f":"IF(Indtast!K16<>\"\",ROUND((60/$X9*Indtast!K$16),0)*$W$1+$B9,IF(Indtast!K17<>\"\",ROUND((60/$X9*Indtast!K$17),0)*$W$1+$B9,\"x\"))","v":"08:58:00"},{"$f":"IF(Indtast!L16<>\"\",ROUND((60/$X9*Indtast!L$16),0)*$W$1+$B9,IF(Indtast!L17<>\"\",ROUND((60/$X9*Indtast!L$17),0)*$W$1+$B9,\"x\"))","v":"09:18:00"},{"$f":"IF(Indtast!M16<>\"\",ROUND((60/$X9*Indtast!M$16),0)*$W$1+$B9,IF(Indtast!M17<>\"\",ROUND((60/$X9*Indtast!M$17),0)*$W$1+$B9,\"x\"))","v":"x"},{"$f":"IF(Indtast!N16<>\"\",ROUND((60/$X9*Indtast!N$16),0)*$W$1+$B9,IF(Indtast!N17<>\"\",ROUND((60/$X9*Indtast!N$17),0)*$W$1+$B9,\"x\"))","v":"x"},{"$f":"IF(Indtast!O16<>\"\",ROUND((60/$X9*Indtast!O$16),0)*$W$1+$B9,IF(Indtast!O17<>\"\",ROUND((60/$X9*Indtast!O$17),0)*$W$1+$B9,\"x\"))","v":"x"},{"$f":"IF(Indtast!P16<>\"\",ROUND((60/$X9*Indtast!P$16),0)*$W$1+$B9,IF(Indtast!P17<>\"\",ROUND((60/$X9*Indtast!P$17),0)*$W$1+$B9,\"x\"))","v":"x"},{"$f":"IF(Indtast!Q16<>\"\",ROUND((60/$X9*Indtast!Q$16),0)*$W$1+$B9,IF(Indtast!Q17<>\"\",ROUND((60/$X9*Indtast!Q$17),0)*$W$1+$B9,\"x\"))","v":"x"},{"$f":"IF(Indtast!R16<>\"\",ROUND((60/$X9*Indtast!R$16),0)*$W$1+$B9,IF(Indtast!R17<>\"\",ROUND((60/$X9*Indtast!R$17),0)*$W$1+$B9,\"x\"))","v":"x"},{"$f":"IF(Indtast!S16<>\"\",ROUND((60/$X9*Indtast!S$16),0)*$W$1+$B9,IF(Indtast!S17<>\"\",ROUND((60/$X9*Indtast!S$17),0)*$W$1+$B9,\"x\"))","v":"x"},{"$f":"IF(Indtast!T16<>\"\",ROUND((60/$X9*Indtast!T$16),0)*$W$1+$B9,IF(Indtast!T17<>\"\",ROUND((60/$X9*Indtast!T$17),0)*$W$1+$B9,\"x\"))","v":"x"},{"$f":"IF(Indtast!U16<>\"\",ROUND((60/$X9*Indtast!U$16),0)*$W$1+$B9,IF(Indtast!U17<>\"\",ROUND((60/$X9*Indtast!U$17),0)*$W$1+$B9,\"x\"))","v":"x"},{"$f":"IF(Indtast!V16<>\"\",ROUND((60/$X9*Indtast!V$16),0)*$W$1+$B9,IF(Indtast!V17<>\"\",ROUND((60/$X9*Indtast!V$17),0)*$W$1+$B9,\"x\"))","v":"x"},{"$f":"IF(Indtast!W16<>\"\",ROUND((60/$X9*Indtast!W$16),0)*$W$1+$B9,IF(Indtast!W17<>\"\",ROUND((60/$X9*Indtast!W$17),0)*$W$1+$B9,\"x\"))","v":"x"},{"$f":"IF(Indtast!X16<>\"\",ROUND((60/$X9*Indtast!X$16),0)*$W$1+$B9,IF(Indtast!X17<>\"\",ROUND((60/$X9*Indtast!X$17),0)*$W$1+$B9,\"x\"))","v":"x"},{"$f":"IF(Indtast!Y16<>\"\",ROUND((60/$X9*Indtast!Y$16),0)*$W$1+$B9,IF(Indtast!Y17<>\"\",ROUND((60/$X9*Indtast!Y$17),0)*$W$1+$B9,\"x\"))","v":"x"},{"$f":"IF(Indtast!Z16<>\"\",ROUND((60/$X9*Indtast!Z$16),0)*$W$1+$B9,IF(Indtast!Z17<>\"\",ROUND((60/$X9*Indtast!Z$17),0)*$W$1+$B9,\"x\"))","v":"x"},{"$f":"IF(Indtast!AA16<>\"\",ROUND((60/$X9*Indtast!AA$16),0)*$W$1+$B9,IF(Indtast!AA17<>\"\",ROUND((60/$X9*Indtast!AA$17),0)*$W$1+$B9,\"x\"))","v":"x"},{"$f":"IF(Indtast!AB16<>\"\",ROUND((60/$X9*Indtast!AB$16),0)*$W$1+$B9,IF(Indtast!AB17<>\"\",ROUND((60/$X9*Indtast!AB$17),0)*$W$1+$B9,\"x\"))","v":"x"},null,{"$f":"Indtast!$D$16","v":34}]
[{"$f":"Indtast!A16&\" \"&Indtast!$C$2","v":"U17P Høj"},{"$f":"IF(Indtast!$B$16<>\"\",Indtast!$B$16,\"\")","v":"08:00:00"},{"$f":"IF(Indtast!I16<>\"\",ROUND((60/$X10*Indtast!I$16),0)*$W$1+$B10,IF(Indtast!I17<>\"\",ROUND((60/$X10*Indtast!I$17),0)*$W$1+$B10,\"x\"))","v":"08:19:00"},{"$f":"IF(Indtast!J16<>\"\",ROUND((60/$X10*Indtast!J$16),0)*$W$1+$B10,IF(Indtast!J17<>\"\",ROUND((60/$X10*Indtast!J$17),0)*$W$1+$B10,\"x\"))","v":"08:38:00"},{"$f":"IF(Indtast!K16<>\"\",ROUND((60/$X10*Indtast!K$16),0)*$W$1+$B10,IF(Indtast!K17<>\"\",ROUND((60/$X10*Indtast!K$17),0)*$W$1+$B10,\"x\"))","v":"08:57:00"},{"$f":"IF(Indtast!L16<>\"\",ROUND((60/$X10*Indtast!L$16),0)*$W$1+$B10,IF(Indtast!L17<>\"\",ROUND((60/$X10*Indtast!L$17),0)*$W$1+$B10,\"x\"))","v":"09:15:00"},{"$f":"IF(Indtast!M16<>\"\",ROUND((60/$X10*Indtast!M$16),0)*$W$1+$B10,IF(Indtast!M17<>\"\",ROUND((60/$X10*Indtast!M$17),0)*$W$1+$B10,\"x\"))","v":"x"},{"$f":"IF(Indtast!N16<>\"\",ROUND((60/$X10*Indtast!N$16),0)*$W$1+$B10,IF(Indtast!N17<>\"\",ROUND((60/$X10*Indtast!N$17),0)*$W$1+$B10,\"x\"))","v":"x"},{"$f":"IF(Indtast!O16<>\"\",ROUND((60/$X10*Indtast!O$16),0)*$W$1+$B10,IF(Indtast!O17<>\"\",ROUND((60/$X10*Indtast!O$17),0)*$W$1+$B10,\"x\"))","v":"x"},{"$f":"IF(Indtast!P16<>\"\",ROUND((60/$X10*Indtast!P$16),0)*$W$1+$B10,IF(Indtast!P17<>\"\",ROUND((60/$X10*Indtast!P$17),0)*$W$1+$B10,\"x\"))","v":"x"},{"$f":"IF(Indtast!Q16<>\"\",ROUND((60/$X10*Indtast!Q$16),0)*$W$1+$B10,IF(Indtast!Q17<>\"\",ROUND((60/$X10*Indtast!Q$17),0)*$W$1+$B10,\"x\"))","v":"x"},{"$f":"IF(Indtast!R16<>\"\",ROUND((60/$X10*Indtast!R$16),0)*$W$1+$B10,IF(Indtast!R17<>\"\",ROUND((60/$X10*Indtast!R$17),0)*$W$1+$B10,\"x\"))","v":"x"},{"$f":"IF(Indtast!S16<>\"\",ROUND((60/$X10*Indtast!S$16),0)*$W$1+$B10,IF(Indtast!S17<>\"\",ROUND((60/$X10*Indtast!S$17),0)*$W$1+$B10,\"x\"))","v":"x"},{"$f":"IF(Indtast!T16<>\"\",ROUND((60/$X10*Indtast!T$16),0)*$W$1+$B10,IF(Indtast!T17<>\"\",ROUND((60/$X10*Indtast!T$17),0)*$W$1+$B10,\"x\"))","v":"x"},{"$f":"IF(Indtast!U16<>\"\",ROUND((60/$X10*Indtast!U$16),0)*$W$1+$B10,IF(Indtast!U17<>\"\",ROUND((60/$X10*Indtast!U$17),0)*$W$1+$B10,\"x\"))","v":"x"},{"$f":"IF(Indtast!V16<>\"\",ROUND((60/$X10*Indtast!V$16),0)*$W$1+$B10,IF(Indtast!V17<>\"\",ROUND((60/$X10*Indtast!V$17),0)*$W$1+$B10,\"x\"))","v":"x"},{"$f":"IF(Indtast!W16<>\"\",ROUND((60/$X10*Indtast!W$16),0)*$W$1+$B10,IF(Indtast!W17<>\"\",ROUND((60/$X10*Indtast!W$17),0)*$W$1+$B10,\"x\"))","v":"x"},{"$f":"IF(Indtast!X16<>\"\",ROUND((60/$X10*Indtast!X$16),0)*$W$1+$B10,IF(Indtast!X17<>\"\",ROUND((60/$X10*Indtast!X$17),0)*$W$1+$B10,\"x\"))","v":"x"},{"$f":"IF(Indtast!Y16<>\"\",ROUND((60/$X10*Indtast!Y$16),0)*$W$1+$B10,IF(Indtast!Y17<>\"\",ROUND((60/$X10*Indtast!Y$17),0)*$W$1+$B10,\"x\"))","v":"x"},{"$f":"IF(Indtast!Z16<>\"\",ROUND((60/$X10*Indtast!Z$16),0)*$W$1+$B10,IF(Indtast!Z17<>\"\",ROUND((60/$X10*Indtast!Z$17),0)*$W$1+$B10,\"x\"))","v":"x"},{"$f":"IF(Indtast!AA16<>\"\",ROUND((60/$X10*Indtast!AA$16),0)*$W$1+$B10,IF(Indtast!AA17<>\"\",ROUND((60/$X10*Indtast!AA$17),0)*$W$1+$B10,\"x\"))","v":"x"},{"$f":"IF(Indtast!AB16<>\"\",ROUND((60/$X10*Indtast!AB$16),0)*$W$1+$B10,IF(Indtast!AB17<>\"\",ROUND((60/$X10*Indtast!AB$17),0)*$W$1+$B10,\"x\"))","v":"x"},null,{"$f":"Indtast!$C$16","v":35}]
[{"$f":"Indtast!$A14&\" \"&Indtast!$E$2","v":"U15P Lav"},{"$f":"IF(Indtast!$B$14<>\"\",Indtast!$B$14,\"\")","v":"08:00:00"},{"$f":"IF(Indtast!I14<>\"\",ROUND((60/$X11*Indtast!I$14),0)*$W$1+$B11,IF(Indtast!I15<>\"\",ROUND((60/$X11*Indtast!I$15),0)*$W$1+$B11,\"x\"))","v":"08:20:00"},{"$f":"IF(Indtast!J14<>\"\",ROUND((60/$X11*Indtast!J$14),0)*$W$1+$B11,IF(Indtast!J15<>\"\",ROUND((60/$X11*Indtast!J$15),0)*$W$1+$B11,\"x\"))","v":"08:40:00"},{"$f":"IF(Indtast!K14<>\"\",ROUND((60/$X11*Indtast!K$14),0)*$W$1+$B11,IF(Indtast!K15<>\"\",ROUND((60/$X11*Indtast!K$15),0)*$W$1+$B11,\"x\"))","v":"09:00:00"},{"$f":"IF(Indtast!L14<>\"\",ROUND((60/$X11*Indtast!L$14),0)*$W$1+$B11,IF(Indtast!L15<>\"\",ROUND((60/$X11*Indtast!L$15),0)*$W$1+$B11,\"x\"))","v":"09:20:00"},{"$f":"IF(Indtast!M14<>\"\",ROUND((60/$X11*Indtast!M$14),0)*$W$1+$B11,IF(Indtast!M15<>\"\",ROUND((60/$X11*Indtast!M$15),0)*$W$1+$B11,\"x\"))","v":"x"},{"$f":"IF(Indtast!N14<>\"\",ROUND((60/$X11*Indtast!N$14),0)*$W$1+$B11,IF(Indtast!N15<>\"\",ROUND((60/$X11*Indtast!N$15),0)*$W$1+$B11,\"x\"))","v":"x"},{"$f":"IF(Indtast!O14<>\"\",ROUND((60/$X11*Indtast!O$14),0)*$W$1+$B11,IF(Indtast!O15<>\"\",ROUND((60/$X11*Indtast!O$15),0)*$W$1+$B11,\"x\"))","v":"x"},{"$f":"IF(Indtast!P14<>\"\",ROUND((60/$X11*Indtast!P$14),0)*$W$1+$B11,IF(Indtast!P15<>\"\",ROUND((60/$X11*Indtast!P$15),0)*$W$1+$B11,\"x\"))","v":"x"},{"$f":"IF(Indtast!Q14<>\"\",ROUND((60/$X11*Indtast!Q$14),0)*$W$1+$B11,IF(Indtast!Q15<>\"\",ROUND((60/$X11*Indtast!Q$15),0)*$W$1+$B11,\"x\"))","v":"x"},{"$f":"IF(Indtast!R14<>\"\",ROUND((60/$X11*Indtast!R$14),0)*$W$1+$B11,IF(Indtast!R15<>\"\",ROUND((60/$X11*Indtast!R$15),0)*$W$1+$B11,\"x\"))","v":"x"},{"$f":"IF(Indtast!S14<>\"\",ROUND((60/$X11*Indtast!S$14),0)*$W$1+$B11,IF(Indtast!S15<>\"\",ROUND((60/$X11*Indtast!S$15),0)*$W$1+$B11,\"x\"))","v":"x"},{"$f":"IF(Indtast!T14<>\"\",ROUND((60/$X11*Indtast!T$14),0)*$W$1+$B11,IF(Indtast!T15<>\"\",ROUND((60/$X11*Indtast!T$15),0)*$W$1+$B11,\"x\"))","v":"x"},{"$f":"IF(Indtast!U14<>\"\",ROUND((60/$X11*Indtast!U$14),0)*$W$1+$B11,IF(Indtast!U15<>\"\",ROUND((60/$X11*Indtast!U$15),0)*$W$1+$B11,\"x\"))","v":"x"},{"$f":"IF(Indtast!V14<>\"\",ROUND((60/$X11*Indtast!V$14),0)*$W$1+$B11,IF(Indtast!V15<>\"\",ROUND((60/$X11*Indtast!V$15),0)*$W$1+$B11,\"x\"))","v":"x"},{"$f":"IF(Indtast!W14<>\"\",ROUND((60/$X11*Indtast!W$14),0)*$W$1+$B11,IF(Indtast!W15<>\"\",ROUND((60/$X11*Indtast!W$15),0)*$W$1+$B11,\"x\"))","v":"x"},{"$f":"IF(Indtast!X14<>\"\",ROUND((60/$X11*Indtast!X$14),0)*$W$1+$B11,IF(Indtast!X15<>\"\",ROUND((60/$X11*Indtast!X$15),0)*$W$1+$B11,\"x\"))","v":"x"},{"$f":"IF(Indtast!Y14<>\"\",ROUND((60/$X11*Indtast!Y$14),0)*$W$1+$B11,IF(Indtast!Y15<>\"\",ROUND((60/$X11*Indtast!Y$15),0)*$W$1+$B11,\"x\"))","v":"x"},{"$f":"IF(Indtast!Z14<>\"\",ROUND((60/$X11*Indtast!Z$14),0)*$W$1+$B11,IF(Indtast!Z15<>\"\",ROUND((60/$X11*Indtast!Z$15),0)*$W$1+$B11,\"x\"))","v":"x"},{"$f":"IF(Indtast!AA14<>\"\",ROUND((60/$X11*Indtast!AA$14),0)*$W$1+$B11,IF(Indtast!AA15<>\"\",ROUND((60/$X11*Indtast!AA$15),0)*$W$1+$B11,\"x\"))","v":"x"},{"$f":"IF(Indtast!AB14<>\"\",ROUND((60/$X11*Indtast!AB$14),0)*$W$1+$B11,IF(Indtast!AB15<>\"\",ROUND((60/$X11*Indtast!AB$15),0)*$W$1+$B11,\"x\"))","v":"x"},null,{"$f":"Indtast!$E$14","v":33}]
[{"$f":"Indtast!A14&\" \"&Indtast!$D$2","v":"U15P Mel"},{"$f":"IF(Indtast!$B$14<>\"\",Indtast!$B$14,\"\")","v":"08:00:00"},{"$f":"IF(Indtast!I14<>\"\",ROUND((60/$X12*Indtast!I$14),0)*$W$1+$B12,IF(Indtast!I15<>\"\",ROUND((60/$X12*Indtast!I$15),0)*$W$1+$B12,\"x\"))","v":"08:19:00"},{"$f":"IF(Indtast!J14<>\"\",ROUND((60/$X12*Indtast!J$14),0)*$W$1+$B12,IF(Indtast!J15<>\"\",ROUND((60/$X12*Indtast!J$15),0)*$W$1+$B12,\"x\"))","v":"08:39:00"},{"$f":"IF(Indtast!K14<>\"\",ROUND((60/$X12*Indtast!K$14),0)*$W$1+$B12,IF(Indtast!K15<>\"\",ROUND((60/$X12*Indtast!K$15),0)*$W$1+$B12,\"x\"))","v":"08:58:00"},{"$f":"IF(Indtast!L14<>\"\",ROUND((60/$X12*Indtast!L$14),0)*$W$1+$B12,IF(Indtast!L15<>\"\",ROUND((60/$X12*Indtast!L$15),0)*$W$1+$B12,\"x\"))","v":"09:18:00"},{"$f":"IF(Indtast!M14<>\"\",ROUND((60/$X12*Indtast!M$14),0)*$W$1+$B12,IF(Indtast!M15<>\"\",ROUND((60/$X12*Indtast!M$15),0)*$W$1+$B12,\"x\"))","v":"x"},{"$f":"IF(Indtast!N14<>\"\",ROUND((60/$X12*Indtast!N$14),0)*$W$1+$B12,IF(Indtast!N15<>\"\",ROUND((60/$X12*Indtast!N$15),0)*$W$1+$B12,\"x\"))","v":"x"},{"$f":"IF(Indtast!O14<>\"\",ROUND((60/$X12*Indtast!O$14),0)*$W$1+$B12,IF(Indtast!O15<>\"\",ROUND((60/$X12*Indtast!O$15),0)*$W$1+$B12,\"x\"))","v":"x"},{"$f":"IF(Indtast!P14<>\"\",ROUND((60/$X12*Indtast!P$14),0)*$W$1+$B12,IF(Indtast!P15<>\"\",ROUND((60/$X12*Indtast!P$15),0)*$W$1+$B12,\"x\"))","v":"x"},{"$f":"IF(Indtast!Q14<>\"\",ROUND((60/$X12*Indtast!Q$14),0)*$W$1+$B12,IF(Indtast!Q15<>\"\",ROUND((60/$X12*Indtast!Q$15),0)*$W$1+$B12,\"x\"))","v":"x"},{"$f":"IF(Indtast!R14<>\"\",ROUND((60/$X12*Indtast!R$14),0)*$W$1+$B12,IF(Indtast!R15<>\"\",ROUND((60/$X12*Indtast!R$15),0)*$W$1+$B12,\"x\"))","v":"x"},{"$f":"IF(Indtast!S14<>\"\",ROUND((60/$X12*Indtast!S$14),0)*$W$1+$B12,IF(Indtast!S15<>\"\",ROUND((60/$X12*Indtast!S$15),0)*$W$1+$B12,\"x\"))","v":"x"},{"$f":"IF(Indtast!T14<>\"\",ROUND((60/$X12*Indtast!T$14),0)*$W$1+$B12,IF(Indtast!T15<>\"\",ROUND((60/$X12*Indtast!T$15),0)*$W$1+$B12,\"x\"))","v":"x"},{"$f":"IF(Indtast!U14<>\"\",ROUND((60/$X12*Indtast!U$14),0)*$W$1+$B12,IF(Indtast!U15<>\"\",ROUND((60/$X12*Indtast!U$15),0)*$W$1+$B12,\"x\"))","v":"x"},{"$f":"IF(Indtast!V14<>\"\",ROUND((60/$X12*Indtast!V$14),0)*$W$1+$B12,IF(Indtast!V15<>\"\",ROUND((60/$X12*Indtast!V$15),0)*$W$1+$B12,\"x\"))","v":"x"},{"$f":"IF(Indtast!W14<>\"\",ROUND((60/$X12*Indtast!W$14),0)*$W$1+$B12,IF(Indtast!W15<>\"\",ROUND((60/$X12*Indtast!W$15),0)*$W$1+$B12,\"x\"))","v":"x"},{"$f":"IF(Indtast!X14<>\"\",ROUND((60/$X12*Indtast!X$14),0)*$W$1+$B12,IF(Indtast!X15<>\"\",ROUND((60/$X12*Indtast!X$15),0)*$W$1+$B12,\"x\"))","v":"x"},{"$f":"IF(Indtast!Y14<>\"\",ROUND((60/$X12*Indtast!Y$14),0)*$W$1+$B12,IF(Indtast!Y15<>\"\",ROUND((60/$X12*Indtast!Y$15),0)*$W$1+$B12,\"x\"))","v":"x"},{"$f":"IF(Indtast!Z14<>\"\",ROUND((60/$X12*Indtast!Z$14),0)*$W$1+$B12,IF(Indtast!Z15<>\"\",ROUND((60/$X12*Indtast!Z$15),0)*$W$1+$B12,\"x\"))","v":"x"},{"$f":"IF(Indtast!AA14<>\"\",ROUND((60/$X12*Indtast!AA$14),0)*$W$1+$B12,IF(Indtast!AA15<>\"\",ROUND((60/$X12*Indtast!AA$15),0)*$W$1+$B12,\"x\"))","v":"x"},{"$f":"IF(Indtast!AB14<>\"\",ROUND((60/$X12*Indtast!AB$14),0)*$W$1+$B12,IF(Indtast!AB15<>\"\",ROUND((60/$X12*Indtast!AB$15),0)*$W$1+$B12,\"x\"))","v":"x"},null,{"$f":"Indtast!$D$14","v":34}]
[{"$f":"Indtast!A14&\" \"&Indtast!$C$2","v":"U15P Høj"},{"$f":"IF(Indtast!$B$14<>\"\",Indtast!$B$14,\"\")","v":"08:00:00"},{"$f":"IF(Indtast!I14<>\"\",ROUND((60/$X13*Indtast!I$14),0)*$W$1+$B13,IF(Indtast!I15<>\"\",ROUND((60/$X13*Indtast!I$15),0)*$W$1+$B13,\"x\"))","v":"08:19:00"},{"$f":"IF(Indtast!J14<>\"\",ROUND((60/$X13*Indtast!J$14),0)*$W$1+$B13,IF(Indtast!J15<>\"\",ROUND((60/$X13*Indtast!J$15),0)*$W$1+$B13,\"x\"))","v":"08:38:00"},{"$f":"IF(Indtast!K14<>\"\",ROUND((60/$X13*Indtast!K$14),0)*$W$1+$B13,IF(Indtast!K15<>\"\",ROUND((60/$X13*Indtast!K$15),0)*$W$1+$B13,\"x\"))","v":"08:57:00"},{"$f":"IF(Indtast!L14<>\"\",ROUND((60/$X13*Indtast!L$14),0)*$W$1+$B13,IF(Indtast!L15<>\"\",ROUND((60/$X13*Indtast!L$15),0)*$W$1+$B13,\"x\"))","v":"09:15:00"},{"$f":"IF(Indtast!M14<>\"\",ROUND((60/$X13*Indtast!M$14),0)*$W$1+$B13,IF(Indtast!M15<>\"\",ROUND((60/$X13*Indtast!M$15),0)*$W$1+$B13,\"x\"))","v":"x"},{"$f":"IF(Indtast!N14<>\"\",ROUND((60/$X13*Indtast!N$14),0)*$W$1+$B13,IF(Indtast!N15<>\"\",ROUND((60/$X13*Indtast!N$15),0)*$W$1+$B13,\"x\"))","v":"x"},{"$f":"IF(Indtast!O14<>\"\",ROUND((60/$X13*Indtast!O$14),0)*$W$1+$B13,IF(Indtast!O15<>\"\",ROUND((60/$X13*Indtast!O$15),0)*$W$1+$B13,\"x\"))","v":"x"},{"$f":"IF(Indtast!P14<>\"\",ROUND((60/$X13*Indtast!P$14),0)*$W$1+$B13,IF(Indtast!P15<>\"\",ROUND((60/$X13*Indtast!P$15),0)*$W$1+$B13,\"x\"))","v":"x"},{"$f":"IF(Indtast!Q14<>\"\",ROUND((60/$X13*Indtast!Q$14),0)*$W$1+$B13,IF(Indtast!Q15<>\"\",ROUND((60/$X13*Indtast!Q$15),0)*$W$1+$B13,\"x\"))","v":"x"},{"$f":"IF(Indtast!R14<>\"\",ROUND((60/$X13*Indtast!R$14),0)*$W$1+$B13,IF(Indtast!R15<>\"\",ROUND((60/$X13*Indtast!R$15),0)*$W$1+$B13,\"x\"))","v":"x"},{"$f":"IF(Indtast!S14<>\"\",ROUND((60/$X13*Indtast!S$14),0)*$W$1+$B13,IF(Indtast!S15<>\"\",ROUND((60/$X13*Indtast!S$15),0)*$W$1+$B13,\"x\"))","v":"x"},{"$f":"IF(Indtast!T14<>\"\",ROUND((60/$X13*Indtast!T$14),0)*$W$1+$B13,IF(Indtast!T15<>\"\",ROUND((60/$X13*Indtast!T$15),0)*$W$1+$B13,\"x\"))","v":"x"},{"$f":"IF(Indtast!U14<>\"\",ROUND((60/$X13*Indtast!U$14),0)*$W$1+$B13,IF(Indtast!U15<>\"\",ROUND((60/$X13*Indtast!U$15),0)*$W$1+$B13,\"x\"))","v":"x"},{"$f":"IF(Indtast!V14<>\"\",ROUND((60/$X13*Indtast!V$14),0)*$W$1+$B13,IF(Indtast!V15<>\"\",ROUND((60/$X13*Indtast!V$15),0)*$W$1+$B13,\"x\"))","v":"x"},{"$f":"IF(Indtast!W14<>\"\",ROUND((60/$X13*Indtast!W$14),0)*$W$1+$B13,IF(Indtast!W15<>\"\",ROUND((60/$X13*Indtast!W$15),0)*$W$1+$B13,\"x\"))","v":"x"},{"$f":"IF(Indtast!X14<>\"\",ROUND((60/$X13*Indtast!X$14),0)*$W$1+$B13,IF(Indtast!X15<>\"\",ROUND((60/$X13*Indtast!X$15),0)*$W$1+$B13,\"x\"))","v":"x"},{"$f":"IF(Indtast!Y14<>\"\",ROUND((60/$X13*Indtast!Y$14),0)*$W$1+$B13,IF(Indtast!Y15<>\"\",ROUND((60/$X13*Indtast!Y$15),0)*$W$1+$B13,\"x\"))","v":"x"},{"$f":"IF(Indtast!Z14<>\"\",ROUND((60/$X13*Indtast!Z$14),0)*$W$1+$B13,IF(Indtast!Z15<>\"\",ROUND((60/$X13*Indtast!Z$15),0)*$W$1+$B13,\"x\"))","v":"x"},{"$f":"IF(Indtast!AA14<>\"\",ROUND((60/$X13*Indtast!AA$14),0)*$W$1+$B13,IF(Indtast!AA15<>\"\",ROUND((60/$X13*Indtast!AA$15),0)*$W$1+$B13,\"x\"))","v":"x"},{"$f":"IF(Indtast!AB14<>\"\",ROUND((60/$X13*Indtast!AB$14),0)*$W$1+$B13,IF(Indtast!AB15<>\"\",ROUND((60/$X13*Indtast!AB$15),0)*$W$1+$B13,\"x\"))","v":"x"},null,{"$f":"Indtast!$C$14","v":35}]
[{"$f":"Indtast!$A8&\" \"&Indtast!$E$2","v":"U13 Lav"},{"$f":"IF(Indtast!$B$8<>\"\",Indtast!$B$8,\"\")","v":"08:05:00"},{"$f":"IF(Indtast!I8<>\"\",ROUND((60/$X14*Indtast!I$8),0)*$W$1+$B14,IF(Indtast!I9<>\"\",ROUND((60/$X14*Indtast!I$9),0)*$W$1+$B14,\"x\"))","v":"08:27:00"},{"$f":"IF(Indtast!J8<>\"\",ROUND((60/$X14*Indtast!J$8),0)*$W$1+$B14,IF(Indtast!J9<>\"\",ROUND((60/$X14*Indtast!J$9),0)*$W$1+$B14,\"x\"))","v":"08:49:00"},{"$f":"IF(Indtast!K8<>\"\",ROUND((60/$X14*Indtast!K$8),0)*$W$1+$B14,IF(Indtast!K9<>\"\",ROUND((60/$X14*Indtast!K$9),0)*$W$1+$B14,\"x\"))","v":"x"},{"$f":"IF(Indtast!L8<>\"\",ROUND((60/$X14*Indtast!L$8),0)*$W$1+$B14,IF(Indtast!L9<>\"\",ROUND((60/$X14*Indtast!L$9),0)*$W$1+$B14,\"x\"))","v":"x"},{"$f":"IF(Indtast!M8<>\"\",ROUND((60/$X14*Indtast!M$8),0)*$W$1+$B14,IF(Indtast!M9<>\"\",ROUND((60/$X14*Indtast!M$9),0)*$W$1+$B14,\"x\"))","v":"x"},{"$f":"IF(Indtast!N8<>\"\",ROUND((60/$X14*Indtast!N$8),0)*$W$1+$B14,IF(Indtast!N9<>\"\",ROUND((60/$X14*Indtast!N$9),0)*$W$1+$B14,\"x\"))","v":"x"},{"$f":"IF(Indtast!O8<>\"\",ROUND((60/$X14*Indtast!O$8),0)*$W$1+$B14,IF(Indtast!O9<>\"\",ROUND((60/$X14*Indtast!O$9),0)*$W$1+$B14,\"x\"))","v":"x"},{"$f":"IF(Indtast!P8<>\"\",ROUND((60/$X14*Indtast!P$8),0)*$W$1+$B14,IF(Indtast!P9<>\"\",ROUND((60/$X14*Indtast!P$9),0)*$W$1+$B14,\"x\"))","v":"x"},{"$f":"IF(Indtast!Q8<>\"\",ROUND((60/$X14*Indtast!Q$8),0)*$W$1+$B14,IF(Indtast!Q9<>\"\",ROUND((60/$X14*Indtast!Q$9),0)*$W$1+$B14,\"x\"))","v":"x"},{"$f":"IF(Indtast!R8<>\"\",ROUND((60/$X14*Indtast!R$8),0)*$W$1+$B14,IF(Indtast!R9<>\"\",ROUND((60/$X14*Indtast!R$9),0)*$W$1+$B14,\"x\"))","v":"x"},{"$f":"IF(Indtast!S8<>\"\",ROUND((60/$X14*Indtast!S$8),0)*$W$1+$B14,IF(Indtast!S9<>\"\",ROUND((60/$X14*Indtast!S$9),0)*$W$1+$B14,\"x\"))","v":"x"},{"$f":"IF(Indtast!T8<>\"\",ROUND((60/$X14*Indtast!T$8),0)*$W$1+$B14,IF(Indtast!T9<>\"\",ROUND((60/$X14*Indtast!T$9),0)*$W$1+$B14,\"x\"))","v":"x"},{"$f":"IF(Indtast!U8<>\"\",ROUND((60/$X14*Indtast!U$8),0)*$W$1+$B14,IF(Indtast!U9<>\"\",ROUND((60/$X14*Indtast!U$9),0)*$W$1+$B14,\"x\"))","v":"x"},{"$f":"IF(Indtast!V8<>\"\",ROUND((60/$X14*Indtast!V$8),0)*$W$1+$B14,IF(Indtast!V9<>\"\",ROUND((60/$X14*Indtast!V$9),0)*$W$1+$B14,\"x\"))","v":"x"},{"$f":"IF(Indtast!W8<>\"\",ROUND((60/$X14*Indtast!W$8),0)*$W$1+$B14,IF(Indtast!W9<>\"\",ROUND((60/$X14*Indtast!W$9),0)*$W$1+$B14,\"x\"))","v":"x"},{"$f":"IF(Indtast!X8<>\"\",ROUND((60/$X14*Indtast!X$8),0)*$W$1+$B14,IF(Indtast!X9<>\"\",ROUND((60/$X14*Indtast!X$9),0)*$W$1+$B14,\"x\"))","v":"x"},{"$f":"IF(Indtast!Y8<>\"\",ROUND((60/$X14*Indtast!Y$8),0)*$W$1+$B14,IF(Indtast!Y9<>\"\",ROUND((60/$X14*Indtast!Y$9),0)*$W$1+$B14,\"x\"))","v":"x"},{"$f":"IF(Indtast!Z8<>\"\",ROUND((60/$X14*Indtast!Z$8),0)*$W$1+$B14,IF(Indtast!Z9<>\"\",ROUND((60/$X14*Indtast!Z$9),0)*$W$1+$B14,\"x\"))","v":"x"},{"$f":"IF(Indtast!AA8<>\"\",ROUND((60/$X14*Indtast!AA$8),0)*$W$1+$B14,IF(Indtast!AA9<>\"\",ROUND((60/$X14*Indtast!AA$9),0)*$W$1+$B14,\"x\"))","v":"x"},{"$f":"IF(Indtast!AB8<>\"\",ROUND((60/$X14*Indtast!AB$8),0)*$W$1+$B14,IF(Indtast!AB9<>\"\",ROUND((60/$X14*Indtast!AB$9),0)*$W$1+$B14,\"x\"))","v":"x"},null,{"$f":"Indtast!$E$8","v":30}]
[{"$f":"Indtast!A8&\" \"&Indtast!$D$2","v":"U13 Mel"},{"$f":"IF(Indtast!$B$8<>\"\",Indtast!$B$8,\"\")","v":"08:05:00"},{"$f":"IF(Indtast!I8<>\"\",ROUND((60/$X15*Indtast!I$8),0)*$W$1+$B15,IF(Indtast!I9<>\"\",ROUND((60/$X15*Indtast!I$9),0)*$W$1+$B15,\"x\"))","v":"08:26:00"},{"$f":"IF(Indtast!J8<>\"\",ROUND((60/$X15*Indtast!J$8),0)*$W$1+$B15,IF(Indtast!J9<>\"\",ROUND((60/$X15*Indtast!J$9),0)*$W$1+$B15,\"x\"))","v":"08:48:00"},{"$f":"IF(Indtast!K8<>\"\",ROUND((60/$X15*Indtast!K$8),0)*$W$1+$B15,IF(Indtast!K9<>\"\",ROUND((60/$X15*Indtast!K$9),0)*$W$1+$B15,\"x\"))","v":"x"},{"$f":"IF(Indtast!L8<>\"\",ROUND((60/$X15*Indtast!L$8),0)*$W$1+$B15,IF(Indtast!L9<>\"\",ROUND((60/$X15*Indtast!L$9),0)*$W$1+$B15,\"x\"))","v":"x"},{"$f":"IF(Indtast!M8<>\"\",ROUND((60/$X15*Indtast!M$8),0)*$W$1+$B15,IF(Indtast!M9<>\"\",ROUND((60/$X15*Indtast!M$9),0)*$W$1+$B15,\"x\"))","v":"x"},{"$f":"IF(Indtast!N8<>\"\",ROUND((60/$X15*Indtast!N$8),0)*$W$1+$B15,IF(Indtast!N9<>\"\",ROUND((60/$X15*Indtast!N$9),0)*$W$1+$B15,\"x\"))","v":"x"},{"$f":"IF(Indtast!O8<>\"\",ROUND((60/$X15*Indtast!O$8),0)*$W$1+$B15,IF(Indtast!O9<>\"\",ROUND((60/$X15*Indtast!O$9),0)*$W$1+$B15,\"x\"))","v":"x"},{"$f":"IF(Indtast!P8<>\"\",ROUND((60/$X15*Indtast!P$8),0)*$W$1+$B15,IF(Indtast!P9<>\"\",ROUND((60/$X15*Indtast!P$9),0)*$W$1+$B15,\"x\"))","v":"x"},{"$f":"IF(Indtast!Q8<>\"\",ROUND((60/$X15*Indtast!Q$8),0)*$W$1+$B15,IF(Indtast!Q9<>\"\",ROUND((60/$X15*Indtast!Q$9),0)*$W$1+$B15,\"x\"))","v":"x"},{"$f":"IF(Indtast!R8<>\"\",ROUND((60/$X15*Indtast!R$8),0)*$W$1+$B15,IF(Indtast!R9<>\"\",ROUND((60/$X15*Indtast!R$9),0)*$W$1+$B15,\"x\"))","v":"x"},{"$f":"IF(Indtast!S8<>\"\",ROUND((60/$X15*Indtast!S$8),0)*$W$1+$B15,IF(Indtast!S9<>\"\",ROUND((60/$X15*Indtast!S$9),0)*$W$1+$B15,\"x\"))","v":"x"},{"$f":"IF(Indtast!T8<>\"\",ROUND((60/$X15*Indtast!T$8),0)*$W$1+$B15,IF(Indtast!T9<>\"\",ROUND((60/$X15*Indtast!T$9),0)*$W$1+$B15,\"x\"))","v":"x"},{"$f":"IF(Indtast!U8<>\"\",ROUND((60/$X15*Indtast!U$8),0)*$W$1+$B15,IF(Indtast!U9<>\"\",ROUND((60/$X15*Indtast!U$9),0)*$W$1+$B15,\"x\"))","v":"x"},{"$f":"IF(Indtast!V8<>\"\",ROUND((60/$X15*Indtast!V$8),0)*$W$1+$B15,IF(Indtast!V9<>\"\",ROUND((60/$X15*Indtast!V$9),0)*$W$1+$B15,\"x\"))","v":"x"},{"$f":"IF(Indtast!W8<>\"\",ROUND((60/$X15*Indtast!W$8),0)*$W$1+$B15,IF(Indtast!W9<>\"\",ROUND((60/$X15*Indtast!W$9),0)*$W$1+$B15,\"x\"))","v":"x"},{"$f":"IF(Indtast!X8<>\"\",ROUND((60/$X15*Indtast!X$8),0)*$W$1+$B15,IF(Indtast!X9<>\"\",ROUND((60/$X15*Indtast!X$9),0)*$W$1+$B15,\"x\"))","v":"x"},{"$f":"IF(Indtast!Y8<>\"\",ROUND((60/$X15*Indtast!Y$8),0)*$W$1+$B15,IF(Indtast!Y9<>\"\",ROUND((60/$X15*Indtast!Y$9),0)*$W$1+$B15,\"x\"))","v":"x"},{"$f":"IF(Indtast!Z8<>\"\",ROUND((60/$X15*Indtast!Z$8),0)*$W$1+$B15,IF(Indtast!Z9<>\"\",ROUND((60/$X15*Indtast!Z$9),0)*$W$1+$B15,\"x\"))","v":"x"},{"$f":"IF(Indtast!AA8<>\"\",ROUND((60/$X15*Indtast!AA$8),0)*$W$1+$B15,IF(Indtast!AA9<>\"\",ROUND((60/$X15*Indtast!AA$9),0)*$W$1+$B15,\"x\"))","v":"x"},{"$f":"IF(Indtast!AB8<>\"\",ROUND((60/$X15*Indtast!AB$8),0)*$W$1+$B15,IF(Indtast!AB9<>\"\",ROUND((60/$X15*Indtast!AB$9),0)*$W$1+$B15,\"x\"))","v":"x"},null,{"$f":"Indtast!$D$8","v":31}]
[{"$f":"Indtast!A8&\" \"&Indtast!$C$2","v":"U13 Høj"},{"$f":"IF(Indtast!$B$8<>\"\",Indtast!$B$8,\"\")","v":"08:05:00"},{"$f":"IF(Indtast!I8<>\"\",ROUND((60/$X16*Indtast!I$8),0)*$W$1+$B16,IF(Indtast!I9<>\"\",ROUND((60/$X16*Indtast!I$9),0)*$W$1+$B16,\"x\"))","v":"08:26:00"},{"$f":"IF(Indtast!J8<>\"\",ROUND((60/$X16*Indtast!J$8),0)*$W$1+$B16,IF(Indtast!J9<>\"\",ROUND((60/$X16*Indtast!J$9),0)*$W$1+$B16,\"x\"))","v":"08:46:00"},{"$f":"IF(Indtast!K8<>\"\",ROUND((60/$X16*Indtast!K$8),0)*$W$1+$B16,IF(Indtast!K9<>\"\",ROUND((60/$X16*Indtast!K$9),0)*$W$1+$B16,\"x\"))","v":"x"},{"$f":"IF(Indtast!L8<>\"\",ROUND((60/$X16*Indtast!L$8),0)*$W$1+$B16,IF(Indtast!L9<>\"\",ROUND((60/$X16*Indtast!L$9),0)*$W$1+$B16,\"x\"))","v":"x"},{"$f":"IF(Indtast!M8<>\"\",ROUND((60/$X16*Indtast!M$8),0)*$W$1+$B16,IF(Indtast!M9<>\"\",ROUND((60/$X16*Indtast!M$9),0)*$W$1+$B16,\"x\"))","v":"x"},{"$f":"IF(Indtast!N8<>\"\",ROUND((60/$X16*Indtast!N$8),0)*$W$1+$B16,IF(Indtast!N9<>\"\",ROUND((60/$X16*Indtast!N$9),0)*$W$1+$B16,\"x\"))","v":"x"},{"$f":"IF(Indtast!O8<>\"\",ROUND((60/$X16*Indtast!O$8),0)*$W$1+$B16,IF(Indtast!O9<>\"\",ROUND((60/$X16*Indtast!O$9),0)*$W$1+$B16,\"x\"))","v":"x"},{"$f":"IF(Indtast!P8<>\"\",ROUND((60/$X16*Indtast!P$8),0)*$W$1+$B16,IF(Indtast!P9<>\"\",ROUND((60/$X16*Indtast!P$9),0)*$W$1+$B16,\"x\"))","v":"x"},{"$f":"IF(Indtast!Q8<>\"\",ROUND((60/$X16*Indtast!Q$8),0)*$W$1+$B16,IF(Indtast!Q9<>\"\",ROUND((60/$X16*Indtast!Q$9),0)*$W$1+$B16,\"x\"))","v":"x"},{"$f":"IF(Indtast!R8<>\"\",ROUND((60/$X16*Indtast!R$8),0)*$W$1+$B16,IF(Indtast!R9<>\"\",ROUND((60/$X16*Indtast!R$9),0)*$W$1+$B16,\"x\"))","v":"x"},{"$f":"IF(Indtast!S8<>\"\",ROUND((60/$X16*Indtast!S$8),0)*$W$1+$B16,IF(Indtast!S9<>\"\",ROUND((60/$X16*Indtast!S$9),0)*$W$1+$B16,\"x\"))","v":"x"},{"$f":"IF(Indtast!T8<>\"\",ROUND((60/$X16*Indtast!T$8),0)*$W$1+$B16,IF(Indtast!T9<>\"\",ROUND((60/$X16*Indtast!T$9),0)*$W$1+$B16,\"x\"))","v":"x"},{"$f":"IF(Indtast!U8<>\"\",ROUND((60/$X16*Indtast!U$8),0)*$W$1+$B16,IF(Indtast!U9<>\"\",ROUND((60/$X16*Indtast!U$9),0)*$W$1+$B16,\"x\"))","v":"x"},{"$f":"IF(Indtast!V8<>\"\",ROUND((60/$X16*Indtast!V$8),0)*$W$1+$B16,IF(Indtast!V9<>\"\",ROUND((60/$X16*Indtast!V$9),0)*$W$1+$B16,\"x\"))","v":"x"},{"$f":"IF(Indtast!W8<>\"\",ROUND((60/$X16*Indtast!W$8),0)*$W$1+$B16,IF(Indtast!W9<>\"\",ROUND((60/$X16*Indtast!W$9),0)*$W$1+$B16,\"x\"))","v":"x"},{"$f":"IF(Indtast!X8<>\"\",ROUND((60/$X16*Indtast!X$8),0)*$W$1+$B16,IF(Indtast!X9<>\"\",ROUND((60/$X16*Indtast!X$9),0)*$W$1+$B16,\"x\"))","v":"x"},{"$f":"IF(Indtast!Y8<>\"\",ROUND((60/$X16*Indtast!Y$8),0)*$W$1+$B16,IF(Indtast!Y9<>\"\",ROUND((60/$X16*Indtast!Y$9),0)*$W$1+$B16,\"x\"))","v":"x"},{"$f":"IF(Indtast!Z8<>\"\",ROUND((60/$X16*Indtast!Z$8),0)*$W$1+$B16,IF(Indtast!Z9<>\"\",ROUND((60/$X16*Indtast!Z$9),0)*$W$1+$B16,\"x\"))","v":"x"},{"$f":"IF(Indtast!AA8<>\"\",ROUND((60/$X16*Indtast!AA$8),0)*$W$1+$B16,IF(Indtast!AA9<>\"\",ROUND((60/$X16*Indtast!AA$9),0)*$W$1+$B16,\"x\"))","v":"x"},{"$f":"IF(Indtast!AB8<>\"\",ROUND((60/$X16*Indtast!AB$8),0)*$W$1+$B16,IF(Indtast!AB9<>\"\",ROUND((60/$X16*Indtast!AB$9),0)*$W$1+$B16,\"x\"))","v":"x"},null,{"$f":"Indtast!$C$8","v":32}]
[{"$f":"Indtast!$A10&\" \"&Indtast!$E$2","v":"U13P Lav"},{"$f":"IF(Indtast!$B$10<>\"\",Indtast!$B$10,\"\")","v":"08:05:00"},{"$f":"IF(Indtast!I10<>\"\",ROUND((60/$X17*Indtast!I$10),0)*$W$1+$B17,IF(Indtast!I11<>\"\",ROUND((60/$X17*Indtast!I$11),0)*$W$1+$B17,\"x\"))","v":"08:28:00"},{"$f":"IF(Indtast!J10<>\"\",ROUND((60/$X17*Indtast!J$10),0)*$W$1+$B17,IF(Indtast!J11<>\"\",ROUND((60/$X17*Indtast!J$11),0)*$W$1+$B17,\"x\"))","v":"08:51:00"},{"$f":"IF(Indtast!K10<>\"\",ROUND((60/$X17*Indtast!K$10),0)*$W$1+$B17,IF(Indtast!K11<>\"\",ROUND((60/$X17*Indtast!K$11),0)*$W$1+$B17,\"x\"))","v":"x"},{"$f":"IF(Indtast!L10<>\"\",ROUND((60/$X17*Indtast!L$10),0)*$W$1+$B17,IF(Indtast!L11<>\"\",ROUND((60/$X17*Indtast!L$11),0)*$W$1+$B17,\"x\"))","v":"x"},{"$f":"IF(Indtast!M10<>\"\",ROUND((60/$X17*Indtast!M$10),0)*$W$1+$B17,IF(Indtast!M11<>\"\",ROUND((60/$X17*Indtast!M$11),0)*$W$1+$B17,\"x\"))","v":"x"},{"$f":"IF(Indtast!N10<>\"\",ROUND((60/$X17*Indtast!N$10),0)*$W$1+$B17,IF(Indtast!N11<>\"\",ROUND((60/$X17*Indtast!N$11),0)*$W$1+$B17,\"x\"))","v":"x"},{"$f":"IF(Indtast!O10<>\"\",ROUND((60/$X17*Indtast!O$10),0)*$W$1+$B17,IF(Indtast!O11<>\"\",ROUND((60/$X17*Indtast!O$11),0)*$W$1+$B17,\"x\"))","v":"x"},{"$f":"IF(Indtast!P10<>\"\",ROUND((60/$X17*Indtast!P$10),0)*$W$1+$B17,IF(Indtast!P11<>\"\",ROUND((60/$X17*Indtast!P$11),0)*$W$1+$B17,\"x\"))","v":"x"},{"$f":"IF(Indtast!Q10<>\"\",ROUND((60/$X17*Indtast!Q$10),0)*$W$1+$B17,IF(Indtast!Q11<>\"\",ROUND((60/$X17*Indtast!Q$11),0)*$W$1+$B17,\"x\"))","v":"x"},{"$f":"IF(Indtast!R10<>\"\",ROUND((60/$X17*Indtast!R$10),0)*$W$1+$B17,IF(Indtast!R11<>\"\",ROUND((60/$X17*Indtast!R$11),0)*$W$1+$B17,\"x\"))","v":"x"},{"$f":"IF(Indtast!S10<>\"\",ROUND((60/$X17*Indtast!S$10),0)*$W$1+$B17,IF(Indtast!S11<>\"\",ROUND((60/$X17*Indtast!S$11),0)*$W$1+$B17,\"x\"))","v":"x"},{"$f":"IF(Indtast!T10<>\"\",ROUND((60/$X17*Indtast!T$10),0)*$W$1+$B17,IF(Indtast!T11<>\"\",ROUND((60/$X17*Indtast!T$11),0)*$W$1+$B17,\"x\"))","v":"x"},{"$f":"IF(Indtast!U10<>\"\",ROUND((60/$X17*Indtast!U$10),0)*$W$1+$B17,IF(Indtast!U11<>\"\",ROUND((60/$X17*Indtast!U$11),0)*$W$1+$B17,\"x\"))","v":"x"},{"$f":"IF(Indtast!V10<>\"\",ROUND((60/$X17*Indtast!V$10),0)*$W$1+$B17,IF(Indtast!V11<>\"\",ROUND((60/$X17*Indtast!V$11),0)*$W$1+$B17,\"x\"))","v":"x"},{"$f":"IF(Indtast!W10<>\"\",ROUND((60/$X17*Indtast!W$10),0)*$W$1+$B17,IF(Indtast!W11<>\"\",ROUND((60/$X17*Indtast!W$11),0)*$W$1+$B17,\"x\"))","v":"x"},{"$f":"IF(Indtast!X10<>\"\",ROUND((60/$X17*Indtast!X$10),0)*$W$1+$B17,IF(Indtast!X11<>\"\",ROUND((60/$X17*Indtast!X$11),0)*$W$1+$B17,\"x\"))","v":"x"},{"$f":"IF(Indtast!Y10<>\"\",ROUND((60/$X17*Indtast!Y$10),0)*$W$1+$B17,IF(Indtast!Y11<>\"\",ROUND((60/$X17*Indtast!Y$11),0)*$W$1+$B17,\"x\"))","v":"x"},{"$f":"IF(Indtast!Z10<>\"\",ROUND((60/$X17*Indtast!Z$10),0)*$W$1+$B17,IF(Indtast!Z11<>\"\",ROUND((60/$X17*Indtast!Z$11),0)*$W$1+$B17,\"x\"))","v":"x"},{"$f":"IF(Indtast!AA10<>\"\",ROUND((60/$X17*Indtast!AA$10),0)*$W$1+$B17,IF(Indtast!AA11<>\"\",ROUND((60/$X17*Indtast!AA$11),0)*$W$1+$B17,\"x\"))","v":"x"},{"$f":"IF(Indtast!AB10<>\"\",ROUND((60/$X17*Indtast!AB$10),0)*$W$1+$B17,IF(Indtast!AB11<>\"\",ROUND((60/$X17*Indtast!AB$11),0)*$W$1+$B17,\"x\"))","v":"x"},null,{"$f":"Indtast!$E$10","v":29}]
[{"$f":"Indtast!A10&\" \"&Indtast!$D$2","v":"U13P Mel"},{"$f":"IF(Indtast!$B$10<>\"\",Indtast!$B$10,\"\")","v":"08:05:00"},{"$f":"IF(Indtast!I10<>\"\",ROUND((60/$X18*Indtast!I$10),0)*$W$1+$B18,IF(Indtast!I11<>\"\",ROUND((60/$X18*Indtast!I$11),0)*$W$1+$B18,\"x\"))","v":"08:27:00"},{"$f":"IF(Indtast!J10<>\"\",ROUND((60/$X18*Indtast!J$10),0)*$W$1+$B18,IF(Indtast!J11<>\"\",ROUND((60/$X18*Indtast!J$11),0)*$W$1+$B18,\"x\"))","v":"08:49:00"},{"$f":"IF(Indtast!K10<>\"\",ROUND((60/$X18*Indtast!K$10),0)*$W$1+$B18,IF(Indtast!K11<>\"\",ROUND((60/$X18*Indtast!K$11),0)*$W$1+$B18,\"x\"))","v":"x"},{"$f":"IF(Indtast!L10<>\"\",ROUND((60/$X18*Indtast!L$10),0)*$W$1+$B18,IF(Indtast!L11<>\"\",ROUND((60/$X18*Indtast!L$11),0)*$W$1+$B18,\"x\"))","v":"x"},{"$f":"IF(Indtast!M10<>\"\",ROUND((60/$X18*Indtast!M$10),0)*$W$1+$B18,IF(Indtast!M11<>\"\",ROUND((60/$X18*Indtast!M$11),0)*$W$1+$B18,\"x\"))","v":"x"},{"$f":"IF(Indtast!N10<>\"\",ROUND((60/$X18*Indtast!N$10),0)*$W$1+$B18,IF(Indtast!N11<>\"\",ROUND((60/$X18*Indtast!N$11),0)*$W$1+$B18,\"x\"))","v":"x"},{"$f":"IF(Indtast!O10<>\"\",ROUND((60/$X18*Indtast!O$10),0)*$W$1+$B18,IF(Indtast!O11<>\"\",ROUND((60/$X18*Indtast!O$11),0)*$W$1+$B18,\"x\"))","v":"x"},{"$f":"IF(Indtast!P10<>\"\",ROUND((60/$X18*Indtast!P$10),0)*$W$1+$B18,IF(Indtast!P11<>\"\",ROUND((60/$X18*Indtast!P$11),0)*$W$1+$B18,\"x\"))","v":"x"},{"$f":"IF(Indtast!Q10<>\"\",ROUND((60/$X18*Indtast!Q$10),0)*$W$1+$B18,IF(Indtast!Q11<>\"\",ROUND((60/$X18*Indtast!Q$11),0)*$W$1+$B18,\"x\"))","v":"x"},{"$f":"IF(Indtast!R10<>\"\",ROUND((60/$X18*Indtast!R$10),0)*$W$1+$B18,IF(Indtast!R11<>\"\",ROUND((60/$X18*Indtast!R$11),0)*$W$1+$B18,\"x\"))","v":"x"},{"$f":"IF(Indtast!S10<>\"\",ROUND((60/$X18*Indtast!S$10),0)*$W$1+$B18,IF(Indtast!S11<>\"\",ROUND((60/$X18*Indtast!S$11),0)*$W$1+$B18,\"x\"))","v":"x"},{"$f":"IF(Indtast!T10<>\"\",ROUND((60/$X18*Indtast!T$10),0)*$W$1+$B18,IF(Indtast!T11<>\"\",ROUND((60/$X18*Indtast!T$11),0)*$W$1+$B18,\"x\"))","v":"x"},{"$f":"IF(Indtast!U10<>\"\",ROUND((60/$X18*Indtast!U$10),0)*$W$1+$B18,IF(Indtast!U11<>\"\",ROUND((60/$X18*Indtast!U$11),0)*$W$1+$B18,\"x\"))","v":"x"},{"$f":"IF(Indtast!V10<>\"\",ROUND((60/$X18*Indtast!V$10),0)*$W$1+$B18,IF(Indtast!V11<>\"\",ROUND((60/$X18*Indtast!V$11),0)*$W$1+$B18,\"x\"))","v":"x"},{"$f":"IF(Indtast!W10<>\"\",ROUND((60/$X18*Indtast!W$10),0)*$W$1+$B18,IF(Indtast!W11<>\"\",ROUND((60/$X18*Indtast!W$11),0)*$W$1+$B18,\"x\"))","v":"x"},{"$f":"IF(Indtast!X10<>\"\",ROUND((60/$X18*Indtast!X$10),0)*$W$1+$B18,IF(Indtast!X11<>\"\",ROUND((60/$X18*Indtast!X$11),0)*$W$1+$B18,\"x\"))","v":"x"},{"$f":"IF(Indtast!Y10<>\"\",ROUND((60/$X18*Indtast!Y$10),0)*$W$1+$B18,IF(Indtast!Y11<>\"\",ROUND((60/$X18*Indtast!Y$11),0)*$W$1+$B18,\"x\"))","v":"x"},{"$f":"IF(Indtast!Z10<>\"\",ROUND((60/$X18*Indtast!Z$10),0)*$W$1+$B18,IF(Indtast!Z11<>\"\",ROUND((60/$X18*Indtast!Z$11),0)*$W$1+$B18,\"x\"))","v":"x"},{"$f":"IF(Indtast!AA10<>\"\",ROUND((60/$X18*Indtast!AA$10),0)*$W$1+$B18,IF(Indtast!AA11<>\"\",ROUND((60/$X18*Indtast!AA$11),0)*$W$1+$B18,\"x\"))","v":"x"},{"$f":"IF(Indtast!AB10<>\"\",ROUND((60/$X18*Indtast!AB$10),0)*$W$1+$B18,IF(Indtast!AB11<>\"\",ROUND((60/$X18*Indtast!AB$11),0)*$W$1+$B18,\"x\"))","v":"x"},null,{"$f":"Indtast!$D$10","v":30}]
[{"$f":"Indtast!A10&\" \"&Indtast!$C$2","v":"U13P Høj"},{"$f":"IF(Indtast!$B$10<>\"\",Indtast!$B$10,\"\")","v":"08:05:00"},{"$f":"IF(Indtast!I10<>\"\",ROUND((60/$X19*Indtast!I$10),0)*$W$1+$B19,IF(Indtast!I11<>\"\",ROUND((60/$X19*Indtast!I$11),0)*$W$1+$B19,\"x\"))","v":"08:26:00"},{"$f":"IF(Indtast!J10<>\"\",ROUND((60/$X19*Indtast!J$10),0)*$W$1+$B19,IF(Indtast!J11<>\"\",ROUND((60/$X19*Indtast!J$11),0)*$W$1+$B19,\"x\"))","v":"08:48:00"},{"$f":"IF(Indtast!K10<>\"\",ROUND((60/$X19*Indtast!K$10),0)*$W$1+$B19,IF(Indtast!K11<>\"\",ROUND((60/$X19*Indtast!K$11),0)*$W$1+$B19,\"x\"))","v":"x"},{"$f":"IF(Indtast!L10<>\"\",ROUND((60/$X19*Indtast!L$10),0)*$W$1+$B19,IF(Indtast!L11<>\"\",ROUND((60/$X19*Indtast!L$11),0)*$W$1+$B19,\"x\"))","v":"x"},{"$f":"IF(Indtast!M10<>\"\",ROUND((60/$X19*Indtast!M$10),0)*$W$1+$B19,IF(Indtast!M11<>\"\",ROUND((60/$X19*Indtast!M$11),0)*$W$1+$B19,\"x\"))","v":"x"},{"$f":"IF(Indtast!N10<>\"\",ROUND((60/$X19*Indtast!N$10),0)*$W$1+$B19,IF(Indtast!N11<>\"\",ROUND((60/$X19*Indtast!N$11),0)*$W$1+$B19,\"x\"))","v":"x"},{"$f":"IF(Indtast!O10<>\"\",ROUND((60/$X19*Indtast!O$10),0)*$W$1+$B19,IF(Indtast!O11<>\"\",ROUND((60/$X19*Indtast!O$11),0)*$W$1+$B19,\"x\"))","v":"x"},{"$f":"IF(Indtast!P10<>\"\",ROUND((60/$X19*Indtast!P$10),0)*$W$1+$B19,IF(Indtast!P11<>\"\",ROUND((60/$X19*Indtast!P$11),0)*$W$1+$B19,\"x\"))","v":"x"},{"$f":"IF(Indtast!Q10<>\"\",ROUND((60/$X19*Indtast!Q$10),0)*$W$1+$B19,IF(Indtast!Q11<>\"\",ROUND((60/$X19*Indtast!Q$11),0)*$W$1+$B19,\"x\"))","v":"x"},{"$f":"IF(Indtast!R10<>\"\",ROUND((60/$X19*Indtast!R$10),0)*$W$1+$B19,IF(Indtast!R11<>\"\",ROUND((60/$X19*Indtast!R$11),0)*$W$1+$B19,\"x\"))","v":"x"},{"$f":"IF(Indtast!S10<>\"\",ROUND((60/$X19*Indtast!S$10),0)*$W$1+$B19,IF(Indtast!S11<>\"\",ROUND((60/$X19*Indtast!S$11),0)*$W$1+$B19,\"x\"))","v":"x"},{"$f":"IF(Indtast!T10<>\"\",ROUND((60/$X19*Indtast!T$10),0)*$W$1+$B19,IF(Indtast!T11<>\"\",ROUND((60/$X19*Indtast!T$11),0)*$W$1+$B19,\"x\"))","v":"x"},{"$f":"IF(Indtast!U10<>\"\",ROUND((60/$X19*Indtast!U$10),0)*$W$1+$B19,IF(Indtast!U11<>\"\",ROUND((60/$X19*Indtast!U$11),0)*$W$1+$B19,\"x\"))","v":"x"},{"$f":"IF(Indtast!V10<>\"\",ROUND((60/$X19*Indtast!V$10),0)*$W$1+$B19,IF(Indtast!V11<>\"\",ROUND((60/$X19*Indtast!V$11),0)*$W$1+$B19,\"x\"))","v":"x"},{"$f":"IF(Indtast!W10<>\"\",ROUND((60/$X19*Indtast!W$10),0)*$W$1+$B19,IF(Indtast!W11<>\"\",ROUND((60/$X19*Indtast!W$11),0)*$W$1+$B19,\"x\"))","v":"x"},{"$f":"IF(Indtast!X10<>\"\",ROUND((60/$X19*Indtast!X$10),0)*$W$1+$B19,IF(Indtast!X11<>\"\",ROUND((60/$X19*Indtast!X$11),0)*$W$1+$B19,\"x\"))","v":"x"},{"$f":"IF(Indtast!Y10<>\"\",ROUND((60/$X19*Indtast!Y$10),0)*$W$1+$B19,IF(Indtast!Y11<>\"\",ROUND((60/$X19*Indtast!Y$11),0)*$W$1+$B19,\"x\"))","v":"x"},{"$f":"IF(Indtast!Z10<>\"\",ROUND((60/$X19*Indtast!Z$10),0)*$W$1+$B19,IF(Indtast!Z11<>\"\",ROUND((60/$X19*Indtast!Z$11),0)*$W$1+$B19,\"x\"))","v":"x"},{"$f":"IF(Indtast!AA10<>\"\",ROUND((60/$X19*Indtast!AA$10),0)*$W$1+$B19,IF(Indtast!AA11<>\"\",ROUND((60/$X19*Indtast!AA$11),0)*$W$1+$B19,\"x\"))","v":"x"},{"$f":"IF(Indtast!AB10<>\"\",ROUND((60/$X19*Indtast!AB$10),0)*$W$1+$B19,IF(Indtast!AB11<>\"\",ROUND((60/$X19*Indtast!AB$11),0)*$W$1+$B19,\"x\"))","v":"x"},null,{"$f":"Indtast!$C$10","v":31}]
[{"$f":"IF(Indtast!$A$4<>\"\",Indtast!$A$4&\" \"&Indtast!$E$2,\"\")","v":"U11 Lav"},{"$f":"IF(Indtast!$B$4<>\"\",Indtast!$B$4,\"\")","v":"08:10:00"},{"$f":"IF(Indtast!I4<>\"\",ROUND((60/$X20*Indtast!I$4),0)*$W$1+$B20,IF(Indtast!I5<>\"\",ROUND((60/$X20*Indtast!I$5),0)*$W$1+$B20,\"x\"))","v":"08:33:00"},{"$f":"IF(Indtast!J4<>\"\",ROUND((60/$X20*Indtast!J$4),0)*$W$1+$B20,IF(Indtast!J5<>\"\",ROUND((60/$X20*Indtast!J$5),0)*$W$1+$B20,\"x\"))","v":"x"},{"$f":"IF(Indtast!K4<>\"\",ROUND((60/$X20*Indtast!K$4),0)*$W$1+$B20,IF(Indtast!K5<>\"\",ROUND((60/$X20*Indtast!K$5),0)*$W$1+$B20,\"x\"))","v":"x"},{"$f":"IF(Indtast!L4<>\"\",ROUND((60/$X20*Indtast!L$4),0)*$W$1+$B20,IF(Indtast!L5<>\"\",ROUND((60/$X20*Indtast!L$5),0)*$W$1+$B20,\"x\"))","v":"x"},{"$f":"IF(Indtast!M4<>\"\",ROUND((60/$X20*Indtast!M$4),0)*$W$1+$B20,IF(Indtast!M5<>\"\",ROUND((60/$X20*Indtast!M$5),0)*$W$1+$B20,\"x\"))","v":"x"},{"$f":"IF(Indtast!N4<>\"\",ROUND((60/$X20*Indtast!N$4),0)*$W$1+$B20,IF(Indtast!N5<>\"\",ROUND((60/$X20*Indtast!N$5),0)*$W$1+$B20,\"x\"))","v":"x"},{"$f":"IF(Indtast!O4<>\"\",ROUND((60/$X20*Indtast!O$4),0)*$W$1+$B20,IF(Indtast!O5<>\"\",ROUND((60/$X20*Indtast!O$5),0)*$W$1+$B20,\"x\"))","v":"x"},{"$f":"IF(Indtast!P4<>\"\",ROUND((60/$X20*Indtast!P$4),0)*$W$1+$B20,IF(Indtast!P5<>\"\",ROUND((60/$X20*Indtast!P$5),0)*$W$1+$B20,\"x\"))","v":"x"},{"$f":"IF(Indtast!Q4<>\"\",ROUND((60/$X20*Indtast!Q$4),0)*$W$1+$B20,IF(Indtast!Q5<>\"\",ROUND((60/$X20*Indtast!Q$5),0)*$W$1+$B20,\"x\"))","v":"x"},{"$f":"IF(Indtast!R4<>\"\",ROUND((60/$X20*Indtast!R$4),0)*$W$1+$B20,IF(Indtast!R5<>\"\",ROUND((60/$X20*Indtast!R$5),0)*$W$1+$B20,\"x\"))","v":"x"},{"$f":"IF(Indtast!S4<>\"\",ROUND((60/$X20*Indtast!S$4),0)*$W$1+$B20,IF(Indtast!S5<>\"\",ROUND((60/$X20*Indtast!S$5),0)*$W$1+$B20,\"x\"))","v":"x"},{"$f":"IF(Indtast!T4<>\"\",ROUND((60/$X20*Indtast!T$4),0)*$W$1+$B20,IF(Indtast!T5<>\"\",ROUND((60/$X20*Indtast!T$5),0)*$W$1+$B20,\"x\"))","v":"x"},{"$f":"IF(Indtast!U4<>\"\",ROUND((60/$X20*Indtast!U$4),0)*$W$1+$B20,IF(Indtast!U5<>\"\",ROUND((60/$X20*Indtast!U$5),0)*$W$1+$B20,\"x\"))","v":"x"},{"$f":"IF(Indtast!V4<>\"\",ROUND((60/$X20*Indtast!V$4),0)*$W$1+$B20,IF(Indtast!V5<>\"\",ROUND((60/$X20*Indtast!V$5),0)*$W$1+$B20,\"x\"))","v":"x"},{"$f":"IF(Indtast!W4<>\"\",ROUND((60/$X20*Indtast!W$4),0)*$W$1+$B20,IF(Indtast!W5<>\"\",ROUND((60/$X20*Indtast!W$5),0)*$W$1+$B20,\"x\"))","v":"x"},{"$f":"IF(Indtast!X4<>\"\",ROUND((60/$X20*Indtast!X$4),0)*$W$1+$B20,IF(Indtast!X5<>\"\",ROUND((60/$X20*Indtast!X$5),0)*$W$1+$B20,\"x\"))","v":"x"},{"$f":"IF(Indtast!Y4<>\"\",ROUND((60/$X20*Indtast!Y$4),0)*$W$1+$B20,IF(Indtast!Y5<>\"\",ROUND((60/$X20*Indtast!Y$5),0)*$W$1+$B20,\"x\"))","v":"x"},{"$f":"IF(Indtast!Z4<>\"\",ROUND((60/$X20*Indtast!Z$4),0)*$W$1+$B20,IF(Indtast!Z5<>\"\",ROUND((60/$X20*Indtast!Z$5),0)*$W$1+$B20,\"x\"))","v":"x"},{"$f":"IF(Indtast!AA4<>\"\",ROUND((60/$X20*Indtast!AA$4),0)*$W$1+$B20,IF(Indtast!AA5<>\"\",ROUND((60/$X20*Indtast!AA$5),0)*$W$1+$B20,\"x\"))","v":"x"},{"$f":"IF(Indtast!AB4<>\"\",ROUND((60/$X20*Indtast!AB$4),0)*$W$1+$B20,IF(Indtast!AB5<>\"\",ROUND((60/$X20*Indtast!AB$5),0)*$W$1+$B20,\"x\"))","v":"x"},null,{"$f":"Indtast!$E$4","v":29}]
[{"$f":"IF(Indtast!$A$4<>\"\",Indtast!$A$4&\" \"&Indtast!$D$2,\"\")","v":"U11 Mel"},{"$f":"IF(Indtast!$B$4<>\"\",Indtast!$B$4,\"\")","v":"08:10:00"},{"$f":"IF(Indtast!I4<>\"\",ROUND((60/$X21*Indtast!I$4),0)*$W$1+$B21,IF(Indtast!I5<>\"\",ROUND((60/$X21*Indtast!I$5),0)*$W$1+$B21,\"x\"))","v":"08:32:00"},{"$f":"IF(Indtast!J4<>\"\",ROUND((60/$X21*Indtast!J$4),0)*$W$1+$B21,IF(Indtast!J5<>\"\",ROUND((60/$X21*Indtast!J$5),0)*$W$1+$B21,\"x\"))","v":"x"},{"$f":"IF(Indtast!K4<>\"\",ROUND((60/$X21*Indtast!K$4),0)*$W$1+$B21,IF(Indtast!K5<>\"\",ROUND((60/$X21*Indtast!K$5),0)*$W$1+$B21,\"x\"))","v":"x"},{"$f":"IF(Indtast!L4<>\"\",ROUND((60/$X21*Indtast!L$4),0)*$W$1+$B21,IF(Indtast!L5<>\"\",ROUND((60/$X21*Indtast!L$5),0)*$W$1+$B21,\"x\"))","v":"x"},{"$f":"IF(Indtast!M4<>\"\",ROUND((60/$X21*Indtast!M$4),0)*$W$1+$B21,IF(Indtast!M5<>\"\",ROUND((60/$X21*Indtast!M$5),0)*$W$1+$B21,\"x\"))","v":"x"},{"$f":"IF(Indtast!N4<>\"\",ROUND((60/$X21*Indtast!N$4),0)*$W$1+$B21,IF(Indtast!N5<>\"\",ROUND((60/$X21*Indtast!N$5),0)*$W$1+$B21,\"x\"))","v":"x"},{"$f":"IF(Indtast!O4<>\"\",ROUND((60/$X21*Indtast!O$4),0)*$W$1+$B21,IF(Indtast!O5<>\"\",ROUND((60/$X21*Indtast!O$5),0)*$W$1+$B21,\"x\"))","v":"x"},{"$f":"IF(Indtast!P4<>\"\",ROUND((60/$X21*Indtast!P$4),0)*$W$1+$B21,IF(Indtast!P5<>\"\",ROUND((60/$X21*Indtast!P$5),0)*$W$1+$B21,\"x\"))","v":"x"},{"$f":"IF(Indtast!Q4<>\"\",ROUND((60/$X21*Indtast!Q$4),0)*$W$1+$B21,IF(Indtast!Q5<>\"\",ROUND((60/$X21*Indtast!Q$5),0)*$W$1+$B21,\"x\"))","v":"x"},{"$f":"IF(Indtast!R4<>\"\",ROUND((60/$X21*Indtast!R$4),0)*$W$1+$B21,IF(Indtast!R5<>\"\",ROUND((60/$X21*Indtast!R$5),0)*$W$1+$B21,\"x\"))","v":"x"},{"$f":"IF(Indtast!S4<>\"\",ROUND((60/$X21*Indtast!S$4),0)*$W$1+$B21,IF(Indtast!S5<>\"\",ROUND((60/$X21*Indtast!S$5),0)*$W$1+$B21,\"x\"))","v":"x"},{"$f":"IF(Indtast!T4<>\"\",ROUND((60/$X21*Indtast!T$4),0)*$W$1+$B21,IF(Indtast!T5<>\"\",ROUND((60/$X21*Indtast!T$5),0)*$W$1+$B21,\"x\"))","v":"x"},{"$f":"IF(Indtast!U4<>\"\",ROUND((60/$X21*Indtast!U$4),0)*$W$1+$B21,IF(Indtast!U5<>\"\",ROUND((60/$X21*Indtast!U$5),0)*$W$1+$B21,\"x\"))","v":"x"},{"$f":"IF(Indtast!V4<>\"\",ROUND((60/$X21*Indtast!V$4),0)*$W$1+$B21,IF(Indtast!V5<>\"\",ROUND((60/$X21*Indtast!V$5),0)*$W$1+$B21,\"x\"))","v":"x"},{"$f":"IF(Indtast!W4<>\"\",ROUND((60/$X21*Indtast!W$4),0)*$W$1+$B21,IF(Indtast!W5<>\"\",ROUND((60/$X21*Indtast!W$5),0)*$W$1+$B21,\"x\"))","v":"x"},{"$f":"IF(Indtast!X4<>\"\",ROUND((60/$X21*Indtast!X$4),0)*$W$1+$B21,IF(Indtast!X5<>\"\",ROUND((60/$X21*Indtast!X$5),0)*$W$1+$B21,\"x\"))","v":"x"},{"$f":"IF(Indtast!Y4<>\"\",ROUND((60/$X21*Indtast!Y$4),0)*$W$1+$B21,IF(Indtast!Y5<>\"\",ROUND((60/$X21*Indtast!Y$5),0)*$W$1+$B21,\"x\"))","v":"x"},{"$f":"IF(Indtast!Z4<>\"\",ROUND((60/$X21*Indtast!Z$4),0)*$W$1+$B21,IF(Indtast!Z5<>\"\",ROUND((60/$X21*Indtast!Z$5),0)*$W$1+$B21,\"x\"))","v":"x"},{"$f":"IF(Indtast!AA4<>\"\",ROUND((60/$X21*Indtast!AA$4),0)*$W$1+$B21,IF(Indtast!AA5<>\"\",ROUND((60/$X21*Indtast!AA$5),0)*$W$1+$B21,\"x\"))","v":"x"},{"$f":"IF(Indtast!AB4<>\"\",ROUND((60/$X21*Indtast!AB$4),0)*$W$1+$B21,IF(Indtast!AB5<>\"\",ROUND((60/$X21*Indtast!AB$5),0)*$W$1+$B21,\"x\"))","v":"x"},null,{"$f":"Indtast!$D$4","v":30}]
[{"$f":"IF(Indtast!$A$4<>\"\",Indtast!$A$4&\" \"&Indtast!$C$2,\"\")","v":"U11 Høj"},{"$f":"IF(Indtast!$B$4<>\"\",Indtast!$B$4,\"\")","v":"08:10:00"},{"$f":"IF(Indtast!I4<>\"\",ROUND((60/$X22*Indtast!I$4),0)*$W$1+$B22,IF(Indtast!I5<>\"\",ROUND((60/$X22*Indtast!I$5),0)*$W$1+$B22,\"x\"))","v":"08:31:00"},{"$f":"IF(Indtast!J4<>\"\",ROUND((60/$X22*Indtast!J$4),0)*$W$1+$B22,IF(Indtast!J5<>\"\",ROUND((60/$X22*Indtast!J$5),0)*$W$1+$B22,\"x\"))","v":"x"},{"$f":"IF(Indtast!K4<>\"\",ROUND((60/$X22*Indtast!K$4),0)*$W$1+$B22,IF(Indtast!K5<>\"\",ROUND((60/$X22*Indtast!K$5),0)*$W$1+$B22,\"x\"))","v":"x"},{"$f":"IF(Indtast!L4<>\"\",ROUND((60/$X22*Indtast!L$4),0)*$W$1+$B22,IF(Indtast!L5<>\"\",ROUND((60/$X22*Indtast!L$5),0)*$W$1+$B22,\"x\"))","v":"x"},{"$f":"IF(Indtast!M4<>\"\",ROUND((60/$X22*Indtast!M$4),0)*$W$1+$B22,IF(Indtast!M5<>\"\",ROUND((60/$X22*Indtast!M$5),0)*$W$1+$B22,\"x\"))","v":"x"},{"$f":"IF(Indtast!N4<>\"\",ROUND((60/$X22*Indtast!N$4),0)*$W$1+$B22,IF(Indtast!N5<>\"\",ROUND((60/$X22*Indtast!N$5),0)*$W$1+$B22,\"x\"))","v":"x"},{"$f":"IF(Indtast!O4<>\"\",ROUND((60/$X22*Indtast!O$4),0)*$W$1+$B22,IF(Indtast!O5<>\"\",ROUND((60/$X22*Indtast!O$5),0)*$W$1+$B22,\"x\"))","v":"x"},{"$f":"IF(Indtast!P4<>\"\",ROUND((60/$X22*Indtast!P$4),0)*$W$1+$B22,IF(Indtast!P5<>\"\",ROUND((60/$X22*Indtast!P$5),0)*$W$1+$B22,\"x\"))","v":"x"},{"$f":"IF(Indtast!Q4<>\"\",ROUND((60/$X22*Indtast!Q$4),0)*$W$1+$B22,IF(Indtast!Q5<>\"\",ROUND((60/$X22*Indtast!Q$5),0)*$W$1+$B22,\"x\"))","v":"x"},{"$f":"IF(Indtast!R4<>\"\",ROUND((60/$X22*Indtast!R$4),0)*$W$1+$B22,IF(Indtast!R5<>\"\",ROUND((60/$X22*Indtast!R$5),0)*$W$1+$B22,\"x\"))","v":"x"},{"$f":"IF(Indtast!S4<>\"\",ROUND((60/$X22*Indtast!S$4),0)*$W$1+$B22,IF(Indtast!S5<>\"\",ROUND((60/$X22*Indtast!S$5),0)*$W$1+$B22,\"x\"))","v":"x"},{"$f":"IF(Indtast!T4<>\"\",ROUND((60/$X22*Indtast!T$4),0)*$W$1+$B22,IF(Indtast!T5<>\"\",ROUND((60/$X22*Indtast!T$5),0)*$W$1+$B22,\"x\"))","v":"x"},{"$f":"IF(Indtast!U4<>\"\",ROUND((60/$X22*Indtast!U$4),0)*$W$1+$B22,IF(Indtast!U5<>\"\",ROUND((60/$X22*Indtast!U$5),0)*$W$1+$B22,\"x\"))","v":"x"},{"$f":"IF(Indtast!V4<>\"\",ROUND((60/$X22*Indtast!V$4),0)*$W$1+$B22,IF(Indtast!V5<>\"\",ROUND((60/$X22*Indtast!V$5),0)*$W$1+$B22,\"x\"))","v":"x"},{"$f":"IF(Indtast!W4<>\"\",ROUND((60/$X22*Indtast!W$4),0)*$W$1+$B22,IF(Indtast!W5<>\"\",ROUND((60/$X22*Indtast!W$5),0)*$W$1+$B22,\"x\"))","v":"x"},{"$f":"IF(Indtast!X4<>\"\",ROUND((60/$X22*Indtast!X$4),0)*$W$1+$B22,IF(Indtast!X5<>\"\",ROUND((60/$X22*Indtast!X$5),0)*$W$1+$B22,\"x\"))","v":"x"},{"$f":"IF(Indtast!Y4<>\"\",ROUND((60/$X22*Indtast!Y$4),0)*$W$1+$B22,IF(Indtast!Y5<>\"\",ROUND((60/$X22*Indtast!Y$5),0)*$W$1+$B22,\"x\"))","v":"x"},{"$f":"IF(Indtast!Z4<>\"\",ROUND((60/$X22*Indtast!Z$4),0)*$W$1+$B22,IF(Indtast!Z5<>\"\",ROUND((60/$X22*Indtast!Z$5),0)*$W$1+$B22,\"x\"))","v":"x"},{"$f":"IF(Indtast!AA4<>\"\",ROUND((60/$X22*Indtast!AA$4),0)*$W$1+$B22,IF(Indtast!AA5<>\"\",ROUND((60/$X22*Indtast!AA$5),0)*$W$1+$B22,\"x\"))","v":"x"},{"$f":"IF(Indtast!AB4<>\"\",ROUND((60/$X22*Indtast!AB$4),0)*$W$1+$B22,IF(Indtast!AB5<>\"\",ROUND((60/$X22*Indtast!AB$5),0)*$W$1+$B22,\"x\"))","v":"x"},null,{"$f":"Indtast!$C$4","v":31}]
[{"$f":"IF(Indtast!$A$6<>\"\",Indtast!$A$6&\" \"&Indtast!$E$2,\"\")","v":"U11P Lav"},{"$f":"IF(Indtast!$B$6<>\"\",Indtast!$B$6,\"\")","v":"08:10:00"},{"$f":"IF(Indtast!I6<>\"\",ROUND((60/$X23*Indtast!I$6),0)*$W$1+$B23,IF(Indtast!I7<>\"\",ROUND((60/$X23*Indtast!I$7),0)*$W$1+$B23,\"x\"))","v":"08:34:00"},{"$f":"IF(Indtast!J6<>\"\",ROUND((60/$X23*Indtast!J$6),0)*$W$1+$B23,IF(Indtast!J7<>\"\",ROUND((60/$X23*Indtast!J$7),0)*$W$1+$B23,\"x\"))","v":"x"},{"$f":"IF(Indtast!K6<>\"\",ROUND((60/$X23*Indtast!K$6),0)*$W$1+$B23,IF(Indtast!K7<>\"\",ROUND((60/$X23*Indtast!K$7),0)*$W$1+$B23,\"x\"))","v":"x"},{"$f":"IF(Indtast!L6<>\"\",ROUND((60/$X23*Indtast!L$6),0)*$W$1+$B23,IF(Indtast!L7<>\"\",ROUND((60/$X23*Indtast!L$7),0)*$W$1+$B23,\"x\"))","v":"x"},{"$f":"IF(Indtast!M6<>\"\",ROUND((60/$X23*Indtast!M$6),0)*$W$1+$B23,IF(Indtast!M7<>\"\",ROUND((60/$X23*Indtast!M$7),0)*$W$1+$B23,\"x\"))","v":"x"},{"$f":"IF(Indtast!N6<>\"\",ROUND((60/$X23*Indtast!N$6),0)*$W$1+$B23,IF(Indtast!N7<>\"\",ROUND((60/$X23*Indtast!N$7),0)*$W$1+$B23,\"x\"))","v":"x"},{"$f":"IF(Indtast!O6<>\"\",ROUND((60/$X23*Indtast!O$6),0)*$W$1+$B23,IF(Indtast!O7<>\"\",ROUND((60/$X23*Indtast!O$7),0)*$W$1+$B23,\"x\"))","v":"x"},{"$f":"IF(Indtast!P6<>\"\",ROUND((60/$X23*Indtast!P$6),0)*$W$1+$B23,IF(Indtast!P7<>\"\",ROUND((60/$X23*Indtast!P$7),0)*$W$1+$B23,\"x\"))","v":"x"},{"$f":"IF(Indtast!Q6<>\"\",ROUND((60/$X23*Indtast!Q$6),0)*$W$1+$B23,IF(Indtast!Q7<>\"\",ROUND((60/$X23*Indtast!Q$7),0)*$W$1+$B23,\"x\"))","v":"x"},{"$f":"IF(Indtast!R6<>\"\",ROUND((60/$X23*Indtast!R$6),0)*$W$1+$B23,IF(Indtast!R7<>\"\",ROUND((60/$X23*Indtast!R$7),0)*$W$1+$B23,\"x\"))","v":"x"},{"$f":"IF(Indtast!S6<>\"\",ROUND((60/$X23*Indtast!S$6),0)*$W$1+$B23,IF(Indtast!S7<>\"\",ROUND((60/$X23*Indtast!S$7),0)*$W$1+$B23,\"x\"))","v":"x"},{"$f":"IF(Indtast!T6<>\"\",ROUND((60/$X23*Indtast!T$6),0)*$W$1+$B23,IF(Indtast!T7<>\"\",ROUND((60/$X23*Indtast!T$7),0)*$W$1+$B23,\"x\"))","v":"x"},{"$f":"IF(Indtast!U6<>\"\",ROUND((60/$X23*Indtast!U$6),0)*$W$1+$B23,IF(Indtast!U7<>\"\",ROUND((60/$X23*Indtast!U$7),0)*$W$1+$B23,\"x\"))","v":"x"},{"$f":"IF(Indtast!V6<>\"\",ROUND((60/$X23*Indtast!V$6),0)*$W$1+$B23,IF(Indtast!V7<>\"\",ROUND((60/$X23*Indtast!V$7),0)*$W$1+$B23,\"x\"))","v":"x"},{"$f":"IF(Indtast!W6<>\"\",ROUND((60/$X23*Indtast!W$6),0)*$W$1+$B23,IF(Indtast!W7<>\"\",ROUND((60/$X23*Indtast!W$7),0)*$W$1+$B23,\"x\"))","v":"x"},{"$f":"IF(Indtast!X6<>\"\",ROUND((60/$X23*Indtast!X$6),0)*$W$1+$B23,IF(Indtast!X7<>\"\",ROUND((60/$X23*Indtast!X$7),0)*$W$1+$B23,\"x\"))","v":"x"},{"$f":"IF(Indtast!Y6<>\"\",ROUND((60/$X23*Indtast!Y$6),0)*$W$1+$B23,IF(Indtast!Y7<>\"\",ROUND((60/$X23*Indtast!Y$7),0)*$W$1+$B23,\"x\"))","v":"x"},{"$f":"IF(Indtast!Z6<>\"\",ROUND((60/$X23*Indtast!Z$6),0)*$W$1+$B23,IF(Indtast!Z7<>\"\",ROUND((60/$X23*Indtast!Z$7),0)*$W$1+$B23,\"x\"))","v":"x"},{"$f":"IF(Indtast!AA6<>\"\",ROUND((60/$X23*Indtast!AA$6),0)*$W$1+$B23,IF(Indtast!AA7<>\"\",ROUND((60/$X23*Indtast!AA$7),0)*$W$1+$B23,\"x\"))","v":"x"},{"$f":"IF(Indtast!AB6<>\"\",ROUND((60/$X23*Indtast!AB$6),0)*$W$1+$B23,IF(Indtast!AB7<>\"\",ROUND((60/$X23*Indtast!AB$7),0)*$W$1+$B23,\"x\"))","v":"x"},null,{"$f":"Indtast!$E6","v":27}]
[{"$f":"Indtast!A6&\" \"&Indtast!$D$2","v":"U11P Mel"},{"$f":"IF(Indtast!$B$6<>\"\",Indtast!$B$6,\"\")","v":"08:10:00"},{"$f":"IF(Indtast!I6<>\"\",ROUND((60/$X24*Indtast!I$6),0)*$W$1+$B24,IF(Indtast!I7<>\"\",ROUND((60/$X24*Indtast!I$7),0)*$W$1+$B24,\"x\"))","v":"08:34:00"},{"$f":"IF(Indtast!J6<>\"\",ROUND((60/$X24*Indtast!J$6),0)*$W$1+$B24,IF(Indtast!J7<>\"\",ROUND((60/$X24*Indtast!J$7),0)*$W$1+$B24,\"x\"))","v":"x"},{"$f":"IF(Indtast!K6<>\"\",ROUND((60/$X24*Indtast!K$6),0)*$W$1+$B24,IF(Indtast!K7<>\"\",ROUND((60/$X24*Indtast!K$7),0)*$W$1+$B24,\"x\"))","v":"x"},{"$f":"IF(Indtast!L6<>\"\",ROUND((60/$X24*Indtast!L$6),0)*$W$1+$B24,IF(Indtast!L7<>\"\",ROUND((60/$X24*Indtast!L$7),0)*$W$1+$B24,\"x\"))","v":"x"},{"$f":"IF(Indtast!M6<>\"\",ROUND((60/$X24*Indtast!M$6),0)*$W$1+$B24,IF(Indtast!M7<>\"\",ROUND((60/$X24*Indtast!M$7),0)*$W$1+$B24,\"x\"))","v":"x"},{"$f":"IF(Indtast!N6<>\"\",ROUND((60/$X24*Indtast!N$6),0)*$W$1+$B24,IF(Indtast!N7<>\"\",ROUND((60/$X24*Indtast!N$7),0)*$W$1+$B24,\"x\"))","v":"x"},{"$f":"IF(Indtast!O6<>\"\",ROUND((60/$X24*Indtast!O$6),0)*$W$1+$B24,IF(Indtast!O7<>\"\",ROUND((60/$X24*Indtast!O$7),0)*$W$1+$B24,\"x\"))","v":"x"},{"$f":"IF(Indtast!P6<>\"\",ROUND((60/$X24*Indtast!P$6),0)*$W$1+$B24,IF(Indtast!P7<>\"\",ROUND((60/$X24*Indtast!P$7),0)*$W$1+$B24,\"x\"))","v":"x"},{"$f":"IF(Indtast!Q6<>\"\",ROUND((60/$X24*Indtast!Q$6),0)*$W$1+$B24,IF(Indtast!Q7<>\"\",ROUND((60/$X24*Indtast!Q$7),0)*$W$1+$B24,\"x\"))","v":"x"},{"$f":"IF(Indtast!R6<>\"\",ROUND((60/$X24*Indtast!R$6),0)*$W$1+$B24,IF(Indtast!R7<>\"\",ROUND((60/$X24*Indtast!R$7),0)*$W$1+$B24,\"x\"))","v":"x"},{"$f":"IF(Indtast!S6<>\"\",ROUND((60/$X24*Indtast!S$6),0)*$W$1+$B24,IF(Indtast!S7<>\"\",ROUND((60/$X24*Indtast!S$7),0)*$W$1+$B24,\"x\"))","v":"x"},{"$f":"IF(Indtast!T6<>\"\",ROUND((60/$X24*Indtast!T$6),0)*$W$1+$B24,IF(Indtast!T7<>\"\",ROUND((60/$X24*Indtast!T$7),0)*$W$1+$B24,\"x\"))","v":"x"},{"$f":"IF(Indtast!U6<>\"\",ROUND((60/$X24*Indtast!U$6),0)*$W$1+$B24,IF(Indtast!U7<>\"\",ROUND((60/$X24*Indtast!U$7),0)*$W$1+$B24,\"x\"))","v":"x"},{"$f":"IF(Indtast!V6<>\"\",ROUND((60/$X24*Indtast!V$6),0)*$W$1+$B24,IF(Indtast!V7<>\"\",ROUND((60/$X24*Indtast!V$7),0)*$W$1+$B24,\"x\"))","v":"x"},{"$f":"IF(Indtast!W6<>\"\",ROUND((60/$X24*Indtast!W$6),0)*$W$1+$B24,IF(Indtast!W7<>\"\",ROUND((60/$X24*Indtast!W$7),0)*$W$1+$B24,\"x\"))","v":"x"},{"$f":"IF(Indtast!X6<>\"\",ROUND((60/$X24*Indtast!X$6),0)*$W$1+$B24,IF(Indtast!X7<>\"\",ROUND((60/$X24*Indtast!X$7),0)*$W$1+$B24,\"x\"))","v":"x"},{"$f":"IF(Indtast!Y6<>\"\",ROUND((60/$X24*Indtast!Y$6),0)*$W$1+$B24,IF(Indtast!Y7<>\"\",ROUND((60/$X24*Indtast!Y$7),0)*$W$1+$B24,\"x\"))","v":"x"},{"$f":"IF(Indtast!Z6<>\"\",ROUND((60/$X24*Indtast!Z$6),0)*$W$1+$B24,IF(Indtast!Z7<>\"\",ROUND((60/$X24*Indtast!Z$7),0)*$W$1+$B24,\"x\"))","v":"x"},{"$f":"IF(Indtast!AA6<>\"\",ROUND((60/$X24*Indtast!AA$6),0)*$W$1+$B24,IF(Indtast!AA7<>\"\",ROUND((60/$X24*Indtast!AA$7),0)*$W$1+$B24,\"x\"))","v":"x"},{"$f":"IF(Indtast!AB6<>\"\",ROUND((60/$X24*Indtast!AB$6),0)*$W$1+$B24,IF(Indtast!AB7<>\"\",ROUND((60/$X24*Indtast!AB$7),0)*$W$1+$B24,\"x\"))","v":"x"},null,{"$f":"Indtast!$D6","v":28}]
[{"$f":"Indtast!A6&\" \"&Indtast!$C$2","v":"U11P Høj"},{"$f":"IF(Indtast!$B$6<>\"\",Indtast!$B$6,\"\")","v":"08:10:00"},{"$f":"IF(Indtast!I6<>\"\",ROUND((60/$X25*Indtast!I$6),0)*$W$1+$B25,IF(Indtast!I7<>\"\",ROUND((60/$X25*Indtast!I$7),0)*$W$1+$B25,\"x\"))","v":"08:33:00"},{"$f":"IF(Indtast!J6<>\"\",ROUND((60/$X25*Indtast!J$6),0)*$W$1+$B25,IF(Indtast!J7<>\"\",ROUND((60/$X25*Indtast!J$7),0)*$W$1+$B25,\"x\"))","v":"x"},{"$f":"IF(Indtast!K6<>\"\",ROUND((60/$X25*Indtast!K$6),0)*$W$1+$B25,IF(Indtast!K7<>\"\",ROUND((60/$X25*Indtast!K$7),0)*$W$1+$B25,\"x\"))","v":"x"},{"$f":"IF(Indtast!L6<>\"\",ROUND((60/$X25*Indtast!L$6),0)*$W$1+$B25,IF(Indtast!L7<>\"\",ROUND((60/$X25*Indtast!L$7),0)*$W$1+$B25,\"x\"))","v":"x"},{"$f":"IF(Indtast!M6<>\"\",ROUND((60/$X25*Indtast!M$6),0)*$W$1+$B25,IF(Indtast!M7<>\"\",ROUND((60/$X25*Indtast!M$7),0)*$W$1+$B25,\"x\"))","v":"x"},{"$f":"IF(Indtast!N6<>\"\",ROUND((60/$X25*Indtast!N$6),0)*$W$1+$B25,IF(Indtast!N7<>\"\",ROUND((60/$X25*Indtast!N$7),0)*$W$1+$B25,\"x\"))","v":"x"},{"$f":"IF(Indtast!O6<>\"\",ROUND((60/$X25*Indtast!O$6),0)*$W$1+$B25,IF(Indtast!O7<>\"\",ROUND((60/$X25*Indtast!O$7),0)*$W$1+$B25,\"x\"))","v":"x"},{"$f":"IF(Indtast!P6<>\"\",ROUND((60/$X25*Indtast!P$6),0)*$W$1+$B25,IF(Indtast!P7<>\"\",ROUND((60/$X25*Indtast!P$7),0)*$W$1+$B25,\"x\"))","v":"x"},{"$f":"IF(Indtast!Q6<>\"\",ROUND((60/$X25*Indtast!Q$6),0)*$W$1+$B25,IF(Indtast!Q7<>\"\",ROUND((60/$X25*Indtast!Q$7),0)*$W$1+$B25,\"x\"))","v":"x"},{"$f":"IF(Indtast!R6<>\"\",ROUND((60/$X25*Indtast!R$6),0)*$W$1+$B25,IF(Indtast!R7<>\"\",ROUND((60/$X25*Indtast!R$7),0)*$W$1+$B25,\"x\"))","v":"x"},{"$f":"IF(Indtast!S6<>\"\",ROUND((60/$X25*Indtast!S$6),0)*$W$1+$B25,IF(Indtast!S7<>\"\",ROUND((60/$X25*Indtast!S$7),0)*$W$1+$B25,\"x\"))","v":"x"},{"$f":"IF(Indtast!T6<>\"\",ROUND((60/$X25*Indtast!T$6),0)*$W$1+$B25,IF(Indtast!T7<>\"\",ROUND((60/$X25*Indtast!T$7),0)*$W$1+$B25,\"x\"))","v":"x"},{"$f":"IF(Indtast!U6<>\"\",ROUND((60/$X25*Indtast!U$6),0)*$W$1+$B25,IF(Indtast!U7<>\"\",ROUND((60/$X25*Indtast!U$7),0)*$W$1+$B25,\"x\"))","v":"x"},{"$f":"IF(Indtast!V6<>\"\",ROUND((60/$X25*Indtast!V$6),0)*$W$1+$B25,IF(Indtast!V7<>\"\",ROUND((60/$X25*Indtast!V$7),0)*$W$1+$B25,\"x\"))","v":"x"},{"$f":"IF(Indtast!W6<>\"\",ROUND((60/$X25*Indtast!W$6),0)*$W$1+$B25,IF(Indtast!W7<>\"\",ROUND((60/$X25*Indtast!W$7),0)*$W$1+$B25,\"x\"))","v":"x"},{"$f":"IF(Indtast!X6<>\"\",ROUND((60/$X25*Indtast!X$6),0)*$W$1+$B25,IF(Indtast!X7<>\"\",ROUND((60/$X25*Indtast!X$7),0)*$W$1+$B25,\"x\"))","v":"x"},{"$f":"IF(Indtast!Y6<>\"\",ROUND((60/$X25*Indtast!Y$6),0)*$W$1+$B25,IF(Indtast!Y7<>\"\",ROUND((60/$X25*Indtast!Y$7),0)*$W$1+$B25,\"x\"))","v":"x"},{"$f":"IF(Indtast!Z6<>\"\",ROUND((60/$X25*Indtast!Z$6),0)*$W$1+$B25,IF(Indtast!Z7<>\"\",ROUND((60/$X25*Indtast!Z$7),0)*$W$1+$B25,\"x\"))","v":"x"},{"$f":"IF(Indtast!AA6<>\"\",ROUND((60/$X25*Indtast!AA$6),0)*$W$1+$B25,IF(Indtast!AA7<>\"\",ROUND((60/$X25*Indtast!AA$7),0)*$W$1+$B25,\"x\"))","v":"x"},{"$f":"IF(Indtast!AB6<>\"\",ROUND((60/$X25*Indtast!AB$6),0)*$W$1+$B25,IF(Indtast!AB7<>\"\",ROUND((60/$X25*Indtast!AB$7),0)*$W$1+$B25,\"x\"))","v":"x"},null,{"$f":"Indtast!$C6","v":29}]
[{"$f":"Indtast!$A20&\" \"&Indtast!$E$2","v":"U19P Lav"},{"$f":"IF(Indtast!$B$20<>\"\",Indtast!$B$20,\"\")","v":"10:00:00"},{"$f":"IF(Indtast!I20<>\"\",ROUND((60/$X26*Indtast!I$20),0)*$W$1+$B26,IF(Indtast!I21<>\"\",ROUND((60/$X26*Indtast!I$21),0)*$W$1+$B26,\"x\"))","v":"10:19:00"},{"$f":"IF(Indtast!J20<>\"\",ROUND((60/$X26*Indtast!J$20),0)*$W$1+$B26,IF(Indtast!J21<>\"\",ROUND((60/$X26*Indtast!J$21),0)*$W$1+$B26,\"x\"))","v":"10:38:00"},{"$f":"IF(Indtast!K20<>\"\",ROUND((60/$X26*Indtast!K$20),0)*$W$1+$B26,IF(Indtast!K21<>\"\",ROUND((60/$X26*Indtast!K$21),0)*$W$1+$B26,\"x\"))","v":"10:57:00"},{"$f":"IF(Indtast!L20<>\"\",ROUND((60/$X26*Indtast!L$20),0)*$W$1+$B26,IF(Indtast!L21<>\"\",ROUND((60/$X26*Indtast!L$21),0)*$W$1+$B26,\"x\"))","v":"11:15:00"},{"$f":"IF(Indtast!M20<>\"\",ROUND((60/$X26*Indtast!M$20),0)*$W$1+$B26,IF(Indtast!M21<>\"\",ROUND((60/$X26*Indtast!M$21),0)*$W$1+$B26,\"x\"))","v":"11:34:00"},{"$f":"IF(Indtast!N20<>\"\",ROUND((60/$X26*Indtast!N$20),0)*$W$1+$B26,IF(Indtast!N21<>\"\",ROUND((60/$X26*Indtast!N$21),0)*$W$1+$B26,\"x\"))","v":"11:53:00"},{"$f":"IF(Indtast!O20<>\"\",ROUND((60/$X26*Indtast!O$20),0)*$W$1+$B26,IF(Indtast!O21<>\"\",ROUND((60/$X26*Indtast!O$21),0)*$W$1+$B26,\"x\"))","v":"x"},{"$f":"IF(Indtast!P20<>\"\",ROUND((60/$X26*Indtast!P$20),0)*$W$1+$B26,IF(Indtast!P21<>\"\",ROUND((60/$X26*Indtast!P$21),0)*$W$1+$B26,\"x\"))","v":"x"},{"$f":"IF(Indtast!Q20<>\"\",ROUND((60/$X26*Indtast!Q$20),0)*$W$1+$B26,IF(Indtast!Q21<>\"\",ROUND((60/$X26*Indtast!Q$21),0)*$W$1+$B26,\"x\"))","v":"x"},{"$f":"IF(Indtast!R20<>\"\",ROUND((60/$X26*Indtast!R$20),0)*$W$1+$B26,IF(Indtast!R21<>\"\",ROUND((60/$X26*Indtast!R$21),0)*$W$1+$B26,\"x\"))","v":"x"},{"$f":"IF(Indtast!S20<>\"\",ROUND((60/$X26*Indtast!S$20),0)*$W$1+$B26,IF(Indtast!S21<>\"\",ROUND((60/$X26*Indtast!S$21),0)*$W$1+$B26,\"x\"))","v":"x"},{"$f":"IF(Indtast!T20<>\"\",ROUND((60/$X26*Indtast!T$20),0)*$W$1+$B26,IF(Indtast!T21<>\"\",ROUND((60/$X26*Indtast!T$21),0)*$W$1+$B26,\"x\"))","v":"x"},{"$f":"IF(Indtast!U20<>\"\",ROUND((60/$X26*Indtast!U$20),0)*$W$1+$B26,IF(Indtast!U21<>\"\",ROUND((60/$X26*Indtast!U$21),0)*$W$1+$B26,\"x\"))","v":"x"},{"$f":"IF(Indtast!V20<>\"\",ROUND((60/$X26*Indtast!V$20),0)*$W$1+$B26,IF(Indtast!V21<>\"\",ROUND((60/$X26*Indtast!V$21),0)*$W$1+$B26,\"x\"))","v":"x"},{"$f":"IF(Indtast!W20<>\"\",ROUND((60/$X26*Indtast!W$20),0)*$W$1+$B26,IF(Indtast!W21<>\"\",ROUND((60/$X26*Indtast!W$21),0)*$W$1+$B26,\"x\"))","v":"x"},{"$f":"IF(Indtast!X20<>\"\",ROUND((60/$X26*Indtast!X$20),0)*$W$1+$B26,IF(Indtast!X21<>\"\",ROUND((60/$X26*Indtast!X$21),0)*$W$1+$B26,\"x\"))","v":"x"},{"$f":"IF(Indtast!Y20<>\"\",ROUND((60/$X26*Indtast!Y$20),0)*$W$1+$B26,IF(Indtast!Y21<>\"\",ROUND((60/$X26*Indtast!Y$21),0)*$W$1+$B26,\"x\"))","v":"x"},{"$f":"IF(Indtast!Z20<>\"\",ROUND((60/$X26*Indtast!Z$20),0)*$W$1+$B26,IF(Indtast!Z21<>\"\",ROUND((60/$X26*Indtast!Z$21),0)*$W$1+$B26,\"x\"))","v":"x"},{"$f":"IF(Indtast!AA20<>\"\",ROUND((60/$X26*Indtast!AA$20),0)*$W$1+$B26,IF(Indtast!AA21<>\"\",ROUND((60/$X26*Indtast!AA$21),0)*$W$1+$B26,\"x\"))","v":"x"},{"$f":"IF(Indtast!AB20<>\"\",ROUND((60/$X26*Indtast!AB$20),0)*$W$1+$B26,IF(Indtast!AB21<>\"\",ROUND((60/$X26*Indtast!AB$21),0)*$W$1+$B26,\"x\"))","v":"x"},null,{"$f":"Indtast!$E$20","v":35}]
[{"$f":"Indtast!A20&\" \"&Indtast!$D$2","v":"U19P Mel"},{"$f":"IF(Indtast!$B$20<>\"\",Indtast!$B$20,\"\")","v":"10:00:00"},{"$f":"IF(Indtast!I20<>\"\",ROUND((60/$X27*Indtast!I$20),0)*$W$1+$B27,IF(Indtast!I21<>\"\",ROUND((60/$X27*Indtast!I$21),0)*$W$1+$B27,\"x\"))","v":"10:18:00"},{"$f":"IF(Indtast!J20<>\"\",ROUND((60/$X27*Indtast!J$20),0)*$W$1+$B27,IF(Indtast!J21<>\"\",ROUND((60/$X27*Indtast!J$21),0)*$W$1+$B27,\"x\"))","v":"10:37:00"},{"$f":"IF(Indtast!K20<>\"\",ROUND((60/$X27*Indtast!K$20),0)*$W$1+$B27,IF(Indtast!K21<>\"\",ROUND((60/$X27*Indtast!K$21),0)*$W$1+$B27,\"x\"))","v":"10:55:00"},{"$f":"IF(Indtast!L20<>\"\",ROUND((60/$X27*Indtast!L$20),0)*$W$1+$B27,IF(Indtast!L21<>\"\",ROUND((60/$X27*Indtast!L$21),0)*$W$1+$B27,\"x\"))","v":"11:13:00"},{"$f":"IF(Indtast!M20<>\"\",ROUND((60/$X27*Indtast!M$20),0)*$W$1+$B27,IF(Indtast!M21<>\"\",ROUND((60/$X27*Indtast!M$21),0)*$W$1+$B27,\"x\"))","v":"11:32:00"},{"$f":"IF(Indtast!N20<>\"\",ROUND((60/$X27*Indtast!N$20),0)*$W$1+$B27,IF(Indtast!N21<>\"\",ROUND((60/$X27*Indtast!N$21),0)*$W$1+$B27,\"x\"))","v":"11:50:00"},{"$f":"IF(Indtast!O20<>\"\",ROUND((60/$X27*Indtast!O$20),0)*$W$1+$B27,IF(Indtast!O21<>\"\",ROUND((60/$X27*Indtast!O$21),0)*$W$1+$B27,\"x\"))","v":"x"},{"$f":"IF(Indtast!P20<>\"\",ROUND((60/$X27*Indtast!P$20),0)*$W$1+$B27,IF(Indtast!P21<>\"\",ROUND((60/$X27*Indtast!P$21),0)*$W$1+$B27,\"x\"))","v":"x"},{"$f":"IF(Indtast!Q20<>\"\",ROUND((60/$X27*Indtast!Q$20),0)*$W$1+$B27,IF(Indtast!Q21<>\"\",ROUND((60/$X27*Indtast!Q$21),0)*$W$1+$B27,\"x\"))","v":"x"},{"$f":"IF(Indtast!R20<>\"\",ROUND((60/$X27*Indtast!R$20),0)*$W$1+$B27,IF(Indtast!R21<>\"\",ROUND((60/$X27*Indtast!R$21),0)*$W$1+$B27,\"x\"))","v":"x"},{"$f":"IF(Indtast!S20<>\"\",ROUND((60/$X27*Indtast!S$20),0)*$W$1+$B27,IF(Indtast!S21<>\"\",ROUND((60/$X27*Indtast!S$21),0)*$W$1+$B27,\"x\"))","v":"x"},{"$f":"IF(Indtast!T20<>\"\",ROUND((60/$X27*Indtast!T$20),0)*$W$1+$B27,IF(Indtast!T21<>\"\",ROUND((60/$X27*Indtast!T$21),0)*$W$1+$B27,\"x\"))","v":"x"},{"$f":"IF(Indtast!U20<>\"\",ROUND((60/$X27*Indtast!U$20),0)*$W$1+$B27,IF(Indtast!U21<>\"\",ROUND((60/$X27*Indtast!U$21),0)*$W$1+$B27,\"x\"))","v":"x"},{"$f":"IF(Indtast!V20<>\"\",ROUND((60/$X27*Indtast!V$20),0)*$W$1+$B27,IF(Indtast!V21<>\"\",ROUND((60/$X27*Indtast!V$21),0)*$W$1+$B27,\"x\"))","v":"x"},{"$f":"IF(Indtast!W20<>\"\",ROUND((60/$X27*Indtast!W$20),0)*$W$1+$B27,IF(Indtast!W21<>\"\",ROUND((60/$X27*Indtast!W$21),0)*$W$1+$B27,\"x\"))","v":"x"},{"$f":"IF(Indtast!X20<>\"\",ROUND((60/$X27*Indtast!X$20),0)*$W$1+$B27,IF(Indtast!X21<>\"\",ROUND((60/$X27*Indtast!X$21),0)*$W$1+$B27,\"x\"))","v":"x"},{"$f":"IF(Indtast!Y20<>\"\",ROUND((60/$X27*Indtast!Y$20),0)*$W$1+$B27,IF(Indtast!Y21<>\"\",ROUND((60/$X27*Indtast!Y$21),0)*$W$1+$B27,\"x\"))","v":"x"},{"$f":"IF(Indtast!Z20<>\"\",ROUND((60/$X27*Indtast!Z$20),0)*$W$1+$B27,IF(Indtast!Z21<>\"\",ROUND((60/$X27*Indtast!Z$21),0)*$W$1+$B27,\"x\"))","v":"x"},{"$f":"IF(Indtast!AA20<>\"\",ROUND((60/$X27*Indtast!AA$20),0)*$W$1+$B27,IF(Indtast!AA21<>\"\",ROUND((60/$X27*Indtast!AA$21),0)*$W$1+$B27,\"x\"))","v":"x"},{"$f":"IF(Indtast!AB20<>\"\",ROUND((60/$X27*Indtast!AB$20),0)*$W$1+$B27,IF(Indtast!AB21<>\"\",ROUND((60/$X27*Indtast!AB$21),0)*$W$1+$B27,\"x\"))","v":"x"},null,{"$f":"Indtast!$D$20","v":36}]
[{"$f":"Indtast!A20&\" \"&Indtast!$C$2","v":"U19P Høj"},{"$f":"IF(Indtast!$B$20<>\"\",Indtast!$B$20,\"\")","v":"10:00:00"},{"$f":"IF(Indtast!I20<>\"\",ROUND((60/$X28*Indtast!I$20),0)*$W$1+$B28,IF(Indtast!I21<>\"\",ROUND((60/$X28*Indtast!I$21),0)*$W$1+$B28,\"x\"))","v":"10:18:00"},{"$f":"IF(Indtast!J20<>\"\",ROUND((60/$X28*Indtast!J$20),0)*$W$1+$B28,IF(Indtast!J21<>\"\",ROUND((60/$X28*Indtast!J$21),0)*$W$1+$B28,\"x\"))","v":"10:36:00"},{"$f":"IF(Indtast!K20<>\"\",ROUND((60/$X28*Indtast!K$20),0)*$W$1+$B28,IF(Indtast!K21<>\"\",ROUND((60/$X28*Indtast!K$21),0)*$W$1+$B28,\"x\"))","v":"10:54:00"},{"$f":"IF(Indtast!L20<>\"\",ROUND((60/$X28*Indtast!L$20),0)*$W$1+$B28,IF(Indtast!L21<>\"\",ROUND((60/$X28*Indtast!L$21),0)*$W$1+$B28,\"x\"))","v":"11:11:00"},{"$f":"IF(Indtast!M20<>\"\",ROUND((60/$X28*Indtast!M$20),0)*$W$1+$B28,IF(Indtast!M21<>\"\",ROUND((60/$X28*Indtast!M$21),0)*$W$1+$B28,\"x\"))","v":"11:29:00"},{"$f":"IF(Indtast!N20<>\"\",ROUND((60/$X28*Indtast!N$20),0)*$W$1+$B28,IF(Indtast!N21<>\"\",ROUND((60/$X28*Indtast!N$21),0)*$W$1+$B28,\"x\"))","v":"11:47:00"},{"$f":"IF(Indtast!O20<>\"\",ROUND((60/$X28*Indtast!O$20),0)*$W$1+$B28,IF(Indtast!O21<>\"\",ROUND((60/$X28*Indtast!O$21),0)*$W$1+$B28,\"x\"))","v":"x"},{"$f":"IF(Indtast!P20<>\"\",ROUND((60/$X28*Indtast!P$20),0)*$W$1+$B28,IF(Indtast!P21<>\"\",ROUND((60/$X28*Indtast!P$21),0)*$W$1+$B28,\"x\"))","v":"x"},{"$f":"IF(Indtast!Q20<>\"\",ROUND((60/$X28*Indtast!Q$20),0)*$W$1+$B28,IF(Indtast!Q21<>\"\",ROUND((60/$X28*Indtast!Q$21),0)*$W$1+$B28,\"x\"))","v":"x"},{"$f":"IF(Indtast!R20<>\"\",ROUND((60/$X28*Indtast!R$20),0)*$W$1+$B28,IF(Indtast!R21<>\"\",ROUND((60/$X28*Indtast!R$21),0)*$W$1+$B28,\"x\"))","v":"x"},{"$f":"IF(Indtast!S20<>\"\",ROUND((60/$X28*Indtast!S$20),0)*$W$1+$B28,IF(Indtast!S21<>\"\",ROUND((60/$X28*Indtast!S$21),0)*$W$1+$B28,\"x\"))","v":"x"},{"$f":"IF(Indtast!T20<>\"\",ROUND((60/$X28*Indtast!T$20),0)*$W$1+$B28,IF(Indtast!T21<>\"\",ROUND((60/$X28*Indtast!T$21),0)*$W$1+$B28,\"x\"))","v":"x"},{"$f":"IF(Indtast!U20<>\"\",ROUND((60/$X28*Indtast!U$20),0)*$W$1+$B28,IF(Indtast!U21<>\"\",ROUND((60/$X28*Indtast!U$21),0)*$W$1+$B28,\"x\"))","v":"x"},{"$f":"IF(Indtast!V20<>\"\",ROUND((60/$X28*Indtast!V$20),0)*$W$1+$B28,IF(Indtast!V21<>\"\",ROUND((60/$X28*Indtast!V$21),0)*$W$1+$B28,\"x\"))","v":"x"},{"$f":"IF(Indtast!W20<>\"\",ROUND((60/$X28*Indtast!W$20),0)*$W$1+$B28,IF(Indtast!W21<>\"\",ROUND((60/$X28*Indtast!W$21),0)*$W$1+$B28,\"x\"))","v":"x"},{"$f":"IF(Indtast!X20<>\"\",ROUND((60/$X28*Indtast!X$20),0)*$W$1+$B28,IF(Indtast!X21<>\"\",ROUND((60/$X28*Indtast!X$21),0)*$W$1+$B28,\"x\"))","v":"x"},{"$f":"IF(Indtast!Y20<>\"\",ROUND((60/$X28*Indtast!Y$20),0)*$W$1+$B28,IF(Indtast!Y21<>\"\",ROUND((60/$X28*Indtast!Y$21),0)*$W$1+$B28,\"x\"))","v":"x"},{"$f":"IF(Indtast!Z20<>\"\",ROUND((60/$X28*Indtast!Z$20),0)*$W$1+$B28,IF(Indtast!Z21<>\"\",ROUND((60/$X28*Indtast!Z$21),0)*$W$1+$B28,\"x\"))","v":"x"},{"$f":"IF(Indtast!AA20<>\"\",ROUND((60/$X28*Indtast!AA$20),0)*$W$1+$B28,IF(Indtast!AA21<>\"\",ROUND((60/$X28*Indtast!AA$21),0)*$W$1+$B28,\"x\"))","v":"x"},{"$f":"IF(Indtast!AB20<>\"\",ROUND((60/$X28*Indtast!AB$20),0)*$W$1+$B28,IF(Indtast!AB21<>\"\",ROUND((60/$X28*Indtast!AB$21),0)*$W$1+$B28,\"x\"))","v":"x"},null,{"$f":"Indtast!$C$20","v":37}]
[{"$f":"Indtast!$A18&\" \"&Indtast!$E$2","v":"U17 Lav"},{"$f":"IF(Indtast!$B$18<>\"\",Indtast!$B$18,\"\")","v":"10:00:00"},{"$f":"IF(Indtast!I18<>\"\",ROUND((60/$X29*Indtast!I$18),0)*$W$1+$B29,IF(Indtast!I19<>\"\",ROUND((60/$X29*Indtast!I$19),0)*$W$1+$B29,\"x\"))","v":"10:17:00"},{"$f":"IF(Indtast!J18<>\"\",ROUND((60/$X29*Indtast!J$18),0)*$W$1+$B29,IF(Indtast!J19<>\"\",ROUND((60/$X29*Indtast!J$19),0)*$W$1+$B29,\"x\"))","v":"10:35:00"},{"$f":"IF(Indtast!K18<>\"\",ROUND((60/$X29*Indtast!K$18),0)*$W$1+$B29,IF(Indtast!K19<>\"\",ROUND((60/$X29*Indtast!K$19),0)*$W$1+$B29,\"x\"))","v":"10:52:00"},{"$f":"IF(Indtast!L18<>\"\",ROUND((60/$X29*Indtast!L$18),0)*$W$1+$B29,IF(Indtast!L19<>\"\",ROUND((60/$X29*Indtast!L$19),0)*$W$1+$B29,\"x\"))","v":"11:09:00"},{"$f":"IF(Indtast!M18<>\"\",ROUND((60/$X29*Indtast!M$18),0)*$W$1+$B29,IF(Indtast!M19<>\"\",ROUND((60/$X29*Indtast!M$19),0)*$W$1+$B29,\"x\"))","v":"11:27:00"},{"$f":"IF(Indtast!N18<>\"\",ROUND((60/$X29*Indtast!N$18),0)*$W$1+$B29,IF(Indtast!N19<>\"\",ROUND((60/$X29*Indtast!N$19),0)*$W$1+$B29,\"x\"))","v":"11:44:00"},{"$f":"IF(Indtast!O18<>\"\",ROUND((60/$X29*Indtast!O$18),0)*$W$1+$B29,IF(Indtast!O19<>\"\",ROUND((60/$X29*Indtast!O$19),0)*$W$1+$B29,\"x\"))","v":"12:02:00"},{"$f":"IF(Indtast!P18<>\"\",ROUND((60/$X29*Indtast!P$18),0)*$W$1+$B29,IF(Indtast!P19<>\"\",ROUND((60/$X29*Indtast!P$19),0)*$W$1+$B29,\"x\"))","v":"x"},{"$f":"IF(Indtast!Q18<>\"\",ROUND((60/$X29*Indtast!Q$18),0)*$W$1+$B29,IF(Indtast!Q19<>\"\",ROUND((60/$X29*Indtast!Q$19),0)*$W$1+$B29,\"x\"))","v":"x"},{"$f":"IF(Indtast!R18<>\"\",ROUND((60/$X29*Indtast!R$18),0)*$W$1+$B29,IF(Indtast!R19<>\"\",ROUND((60/$X29*Indtast!R$19),0)*$W$1+$B29,\"x\"))","v":"x"},{"$f":"IF(Indtast!S18<>\"\",ROUND((60/$X29*Indtast!S$18),0)*$W$1+$B29,IF(Indtast!S19<>\"\",ROUND((60/$X29*Indtast!S$19),0)*$W$1+$B29,\"x\"))","v":"x"},{"$f":"IF(Indtast!T18<>\"\",ROUND((60/$X29*Indtast!T$18),0)*$W$1+$B29,IF(Indtast!T19<>\"\",ROUND((60/$X29*Indtast!T$19),0)*$W$1+$B29,\"x\"))","v":"x"},{"$f":"IF(Indtast!U18<>\"\",ROUND((60/$X29*Indtast!U$18),0)*$W$1+$B29,IF(Indtast!U19<>\"\",ROUND((60/$X29*Indtast!U$19),0)*$W$1+$B29,\"x\"))","v":"x"},{"$f":"IF(Indtast!V18<>\"\",ROUND((60/$X29*Indtast!V$18),0)*$W$1+$B29,IF(Indtast!V19<>\"\",ROUND((60/$X29*Indtast!V$19),0)*$W$1+$B29,\"x\"))","v":"x"},{"$f":"IF(Indtast!W18<>\"\",ROUND((60/$X29*Indtast!W$18),0)*$W$1+$B29,IF(Indtast!W19<>\"\",ROUND((60/$X29*Indtast!W$19),0)*$W$1+$B29,\"x\"))","v":"x"},{"$f":"IF(Indtast!X18<>\"\",ROUND((60/$X29*Indtast!X$18),0)*$W$1+$B29,IF(Indtast!X19<>\"\",ROUND((60/$X29*Indtast!X$19),0)*$W$1+$B29,\"x\"))","v":"x"},{"$f":"IF(Indtast!Y18<>\"\",ROUND((60/$X29*Indtast!Y$18),0)*$W$1+$B29,IF(Indtast!Y19<>\"\",ROUND((60/$X29*Indtast!Y$19),0)*$W$1+$B29,\"x\"))","v":"x"},{"$f":"IF(Indtast!Z18<>\"\",ROUND((60/$X29*Indtast!Z$18),0)*$W$1+$B29,IF(Indtast!Z19<>\"\",ROUND((60/$X29*Indtast!Z$19),0)*$W$1+$B29,\"x\"))","v":"x"},{"$f":"IF(Indtast!AA18<>\"\",ROUND((60/$X29*Indtast!AA$18),0)*$W$1+$B29,IF(Indtast!AA19<>\"\",ROUND((60/$X29*Indtast!AA$19),0)*$W$1+$B29,\"x\"))","v":"x"},{"$f":"IF(Indtast!AB18<>\"\",ROUND((60/$X29*Indtast!AB$18),0)*$W$1+$B29,IF(Indtast!AB19<>\"\",ROUND((60/$X29*Indtast!AB$19),0)*$W$1+$B29,\"x\"))","v":"x"},null,{"$f":"Indtast!$E$18","v":38}]
[{"$f":"Indtast!A18&\" \"&Indtast!$D$2","v":"U17 Mel"},{"$f":"IF(Indtast!$B$18<>\"\",Indtast!$B$18,\"\")","v":"10:00:00"},{"$f":"IF(Indtast!I18<>\"\",ROUND((60/$X30*Indtast!I$18),0)*$W$1+$B30,IF(Indtast!I19<>\"\",ROUND((60/$X30*Indtast!I$19),0)*$W$1+$B30,\"x\"))","v":"10:17:00"},{"$f":"IF(Indtast!J18<>\"\",ROUND((60/$X30*Indtast!J$18),0)*$W$1+$B30,IF(Indtast!J19<>\"\",ROUND((60/$X30*Indtast!J$19),0)*$W$1+$B30,\"x\"))","v":"10:34:00"},{"$f":"IF(Indtast!K18<>\"\",ROUND((60/$X30*Indtast!K$18),0)*$W$1+$B30,IF(Indtast!K19<>\"\",ROUND((60/$X30*Indtast!K$19),0)*$W$1+$B30,\"x\"))","v":"10:51:00"},{"$f":"IF(Indtast!L18<>\"\",ROUND((60/$X30*Indtast!L$18),0)*$W$1+$B30,IF(Indtast!L19<>\"\",ROUND((60/$X30*Indtast!L$19),0)*$W$1+$B30,\"x\"))","v":"11:08:00"},{"$f":"IF(Indtast!M18<>\"\",ROUND((60/$X30*Indtast!M$18),0)*$W$1+$B30,IF(Indtast!M19<>\"\",ROUND((60/$X30*Indtast!M$19),0)*$W$1+$B30,\"x\"))","v":"11:25:00"},{"$f":"IF(Indtast!N18<>\"\",ROUND((60/$X30*Indtast!N$18),0)*$W$1+$B30,IF(Indtast!N19<>\"\",ROUND((60/$X30*Indtast!N$19),0)*$W$1+$B30,\"x\"))","v":"11:42:00"},{"$f":"IF(Indtast!O18<>\"\",ROUND((60/$X30*Indtast!O$18),0)*$W$1+$B30,IF(Indtast!O19<>\"\",ROUND((60/$X30*Indtast!O$19),0)*$W$1+$B30,\"x\"))","v":"11:58:00"},{"$f":"IF(Indtast!P18<>\"\",ROUND((60/$X30*Indtast!P$18),0)*$W$1+$B30,IF(Indtast!P19<>\"\",ROUND((60/$X30*Indtast!P$19),0)*$W$1+$B30,\"x\"))","v":"x"},{"$f":"IF(Indtast!Q18<>\"\",ROUND((60/$X30*Indtast!Q$18),0)*$W$1+$B30,IF(Indtast!Q19<>\"\",ROUND((60/$X30*Indtast!Q$19),0)*$W$1+$B30,\"x\"))","v":"x"},{"$f":"IF(Indtast!R18<>\"\",ROUND((60/$X30*Indtast!R$18),0)*$W$1+$B30,IF(Indtast!R19<>\"\",ROUND((60/$X30*Indtast!R$19),0)*$W$1+$B30,\"x\"))","v":"x"},{"$f":"IF(Indtast!S18<>\"\",ROUND((60/$X30*Indtast!S$18),0)*$W$1+$B30,IF(Indtast!S19<>\"\",ROUND((60/$X30*Indtast!S$19),0)*$W$1+$B30,\"x\"))","v":"x"},{"$f":"IF(Indtast!T18<>\"\",ROUND((60/$X30*Indtast!T$18),0)*$W$1+$B30,IF(Indtast!T19<>\"\",ROUND((60/$X30*Indtast!T$19),0)*$W$1+$B30,\"x\"))","v":"x"},{"$f":"IF(Indtast!U18<>\"\",ROUND((60/$X30*Indtast!U$18),0)*$W$1+$B30,IF(Indtast!U19<>\"\",ROUND((60/$X30*Indtast!U$19),0)*$W$1+$B30,\"x\"))","v":"x"},{"$f":"IF(Indtast!V18<>\"\",ROUND((60/$X30*Indtast!V$18),0)*$W$1+$B30,IF(Indtast!V19<>\"\",ROUND((60/$X30*Indtast!V$19),0)*$W$1+$B30,\"x\"))","v":"x"},{"$f":"IF(Indtast!W18<>\"\",ROUND((60/$X30*Indtast!W$18),0)*$W$1+$B30,IF(Indtast!W19<>\"\",ROUND((60/$X30*Indtast!W$19),0)*$W$1+$B30,\"x\"))","v":"x"},{"$f":"IF(Indtast!X18<>\"\",ROUND((60/$X30*Indtast!X$18),0)*$W$1+$B30,IF(Indtast!X19<>\"\",ROUND((60/$X30*Indtast!X$19),0)*$W$1+$B30,\"x\"))","v":"x"},{"$f":"IF(Indtast!Y18<>\"\",ROUND((60/$X30*Indtast!Y$18),0)*$W$1+$B30,IF(Indtast!Y19<>\"\",ROUND((60/$X30*Indtast!Y$19),0)*$W$1+$B30,\"x\"))","v":"x"},{"$f":"IF(Indtast!Z18<>\"\",ROUND((60/$X30*Indtast!Z$18),0)*$W$1+$B30,IF(Indtast!Z19<>\"\",ROUND((60/$X30*Indtast!Z$19),0)*$W$1+$B30,\"x\"))","v":"x"},{"$f":"IF(Indtast!AA18<>\"\",ROUND((60/$X30*Indtast!AA$18),0)*$W$1+$B30,IF(Indtast!AA19<>\"\",ROUND((60/$X30*Indtast!AA$19),0)*$W$1+$B30,\"x\"))","v":"x"},{"$f":"IF(Indtast!AB18<>\"\",ROUND((60/$X30*Indtast!AB$18),0)*$W$1+$B30,IF(Indtast!AB19<>\"\",ROUND((60/$X30*Indtast!AB$19),0)*$W$1+$B30,\"x\"))","v":"x"},null,{"$f":"Indtast!$D$18","v":39}]
[{"$f":"Indtast!A18&\" \"&Indtast!$C$2","v":"U17 Høj"},{"$f":"IF(Indtast!$B$18<>\"\",Indtast!$B$18,\"\")","v":"10:00:00"},{"$f":"IF(Indtast!I18<>\"\",ROUND((60/$X31*Indtast!I$18),0)*$W$1+$B31,IF(Indtast!I19<>\"\",ROUND((60/$X31*Indtast!I$19),0)*$W$1+$B31,\"x\"))","v":"10:17:00"},{"$f":"IF(Indtast!J18<>\"\",ROUND((60/$X31*Indtast!J$18),0)*$W$1+$B31,IF(Indtast!J19<>\"\",ROUND((60/$X31*Indtast!J$19),0)*$W$1+$B31,\"x\"))","v":"10:33:00"},{"$f":"IF(Indtast!K18<>\"\",ROUND((60/$X31*Indtast!K$18),0)*$W$1+$B31,IF(Indtast!K19<>\"\",ROUND((60/$X31*Indtast!K$19),0)*$W$1+$B31,\"x\"))","v":"10:50:00"},{"$f":"IF(Indtast!L18<>\"\",ROUND((60/$X31*Indtast!L$18),0)*$W$1+$B31,IF(Indtast!L19<>\"\",ROUND((60/$X31*Indtast!L$19),0)*$W$1+$B31,\"x\"))","v":"11:06:00"},{"$f":"IF(Indtast!M18<>\"\",ROUND((60/$X31*Indtast!M$18),0)*$W$1+$B31,IF(Indtast!M19<>\"\",ROUND((60/$X31*Indtast!M$19),0)*$W$1+$B31,\"x\"))","v":"11:23:00"},{"$f":"IF(Indtast!N18<>\"\",ROUND((60/$X31*Indtast!N$18),0)*$W$1+$B31,IF(Indtast!N19<>\"\",ROUND((60/$X31*Indtast!N$19),0)*$W$1+$B31,\"x\"))","v":"11:39:00"},{"$f":"IF(Indtast!O18<>\"\",ROUND((60/$X31*Indtast!O$18),0)*$W$1+$B31,IF(Indtast!O19<>\"\",ROUND((60/$X31*Indtast!O$19),0)*$W$1+$B31,\"x\"))","v":"11:56:00"},{"$f":"IF(Indtast!P18<>\"\",ROUND((60/$X31*Indtast!P$18),0)*$W$1+$B31,IF(Indtast!P19<>\"\",ROUND((60/$X31*Indtast!P$19),0)*$W$1+$B31,\"x\"))","v":"x"},{"$f":"IF(Indtast!Q18<>\"\",ROUND((60/$X31*Indtast!Q$18),0)*$W$1+$B31,IF(Indtast!Q19<>\"\",ROUND((60/$X31*Indtast!Q$19),0)*$W$1+$B31,\"x\"))","v":"x"},{"$f":"IF(Indtast!R18<>\"\",ROUND((60/$X31*Indtast!R$18),0)*$W$1+$B31,IF(Indtast!R19<>\"\",ROUND((60/$X31*Indtast!R$19),0)*$W$1+$B31,\"x\"))","v":"x"},{"$f":"IF(Indtast!S18<>\"\",ROUND((60/$X31*Indtast!S$18),0)*$W$1+$B31,IF(Indtast!S19<>\"\",ROUND((60/$X31*Indtast!S$19),0)*$W$1+$B31,\"x\"))","v":"x"},{"$f":"IF(Indtast!T18<>\"\",ROUND((60/$X31*Indtast!T$18),0)*$W$1+$B31,IF(Indtast!T19<>\"\",ROUND((60/$X31*Indtast!T$19),0)*$W$1+$B31,\"x\"))","v":"x"},{"$f":"IF(Indtast!U18<>\"\",ROUND((60/$X31*Indtast!U$18),0)*$W$1+$B31,IF(Indtast!U19<>\"\",ROUND((60/$X31*Indtast!U$19),0)*$W$1+$B31,\"x\"))","v":"x"},{"$f":"IF(Indtast!V18<>\"\",ROUND((60/$X31*Indtast!V$18),0)*$W$1+$B31,IF(Indtast!V19<>\"\",ROUND((60/$X31*Indtast!V$19),0)*$W$1+$B31,\"x\"))","v":"x"},{"$f":"IF(Indtast!W18<>\"\",ROUND((60/$X31*Indtast!W$18),0)*$W$1+$B31,IF(Indtast!W19<>\"\",ROUND((60/$X31*Indtast!W$19),0)*$W$1+$B31,\"x\"))","v":"x"},{"$f":"IF(Indtast!X18<>\"\",ROUND((60/$X31*Indtast!X$18),0)*$W$1+$B31,IF(Indtast!X19<>\"\",ROUND((60/$X31*Indtast!X$19),0)*$W$1+$B31,\"x\"))","v":"x"},{"$f":"IF(Indtast!Y18<>\"\",ROUND((60/$X31*Indtast!Y$18),0)*$W$1+$B31,IF(Indtast!Y19<>\"\",ROUND((60/$X31*Indtast!Y$19),0)*$W$1+$B31,\"x\"))","v":"x"},{"$f":"IF(Indtast!Z18<>\"\",ROUND((60/$X31*Indtast!Z$18),0)*$W$1+$B31,IF(Indtast!Z19<>\"\",ROUND((60/$X31*Indtast!Z$19),0)*$W$1+$B31,\"x\"))","v":"x"},{"$f":"IF(Indtast!AA18<>\"\",ROUND((60/$X31*Indtast!AA$18),0)*$W$1+$B31,IF(Indtast!AA19<>\"\",ROUND((60/$X31*Indtast!AA$19),0)*$W$1+$B31,\"x\"))","v":"x"},{"$f":"IF(Indtast!AB18<>\"\",ROUND((60/$X31*Indtast!AB$18),0)*$W$1+$B31,IF(Indtast!AB19<>\"\",ROUND((60/$X31*Indtast!AB$19),0)*$W$1+$B31,\"x\"))","v":"x"},null,{"$f":"Indtast!$C$18","v":40}]
[{"$f":"Indtast!$A22&\" \"&Indtast!$E$2","v":"A Lav"},{"$f":"IF(Indtast!$B$22<>\"\",Indtast!$B$22,\"\")","v":"12:00:00"},{"$f":"IF(Indtast!I22<>\"\",ROUND((60/$X32*Indtast!I$22),0)*$W$1+$B32,IF(Indtast!I23<>\"\",ROUND((60/$X32*Indtast!I$23),0)*$W$1+$B32,\"x\"))","v":"12:15:00"},{"$f":"IF(Indtast!J22<>\"\",ROUND((60/$X32*Indtast!J$22),0)*$W$1+$B32,IF(Indtast!J23<>\"\",ROUND((60/$X32*Indtast!J$23),0)*$W$1+$B32,\"x\"))","v":"12:31:00"},{"$f":"IF(Indtast!K22<>\"\",ROUND((60/$X32*Indtast!K$22),0)*$W$1+$B32,IF(Indtast!K23<>\"\",ROUND((60/$X32*Indtast!K$23),0)*$W$1+$B32,\"x\"))","v":"12:46:00"},{"$f":"IF(Indtast!L22<>\"\",ROUND((60/$X32*Indtast!L$22),0)*$W$1+$B32,IF(Indtast!L23<>\"\",ROUND((60/$X32*Indtast!L$23),0)*$W$1+$B32,\"x\"))","v":"13:01:00"},{"$f":"IF(Indtast!M22<>\"\",ROUND((60/$X32*Indtast!M$22),0)*$W$1+$B32,IF(Indtast!M23<>\"\",ROUND((60/$X32*Indtast!M$23),0)*$W$1+$B32,\"x\"))","v":"13:17:00"},{"$f":"IF(Indtast!N22<>\"\",ROUND((60/$X32*Indtast!N$22),0)*$W$1+$B32,IF(Indtast!N23<>\"\",ROUND((60/$X32*Indtast!N$23),0)*$W$1+$B32,\"x\"))","v":"13:32:00"},{"$f":"IF(Indtast!O22<>\"\",ROUND((60/$X32*Indtast!O$22),0)*$W$1+$B32,IF(Indtast!O23<>\"\",ROUND((60/$X32*Indtast!O$23),0)*$W$1+$B32,\"x\"))","v":"13:47:00"},{"$f":"IF(Indtast!P22<>\"\",ROUND((60/$X32*Indtast!P$22),0)*$W$1+$B32,IF(Indtast!P23<>\"\",ROUND((60/$X32*Indtast!P$23),0)*$W$1+$B32,\"x\"))","v":"14:03:00"},{"$f":"IF(Indtast!Q22<>\"\",ROUND((60/$X32*Indtast!Q$22),0)*$W$1+$B32,IF(Indtast!Q23<>\"\",ROUND((60/$X32*Indtast!Q$23),0)*$W$1+$B32,\"x\"))","v":"14:18:00"},{"$f":"IF(Indtast!R22<>\"\",ROUND((60/$X32*Indtast!R$22),0)*$W$1+$B32,IF(Indtast!R23<>\"\",ROUND((60/$X32*Indtast!R$23),0)*$W$1+$B32,\"x\"))","v":"14:33:00"},{"$f":"IF(Indtast!S22<>\"\",ROUND((60/$X32*Indtast!S$22),0)*$W$1+$B32,IF(Indtast!S23<>\"\",ROUND((60/$X32*Indtast!S$23),0)*$W$1+$B32,\"x\"))","v":"14:49:00"},{"$f":"IF(Indtast!T22<>\"\",ROUND((60/$X32*Indtast!T$22),0)*$W$1+$B32,IF(Indtast!T23<>\"\",ROUND((60/$X32*Indtast!T$23),0)*$W$1+$B32,\"x\"))","v":"15:04:00"},{"$f":"IF(Indtast!U22<>\"\",ROUND((60/$X32*Indtast!U$22),0)*$W$1+$B32,IF(Indtast!U23<>\"\",ROUND((60/$X32*Indtast!U$23),0)*$W$1+$B32,\"x\"))","v":"x"},{"$f":"IF(Indtast!V22<>\"\",ROUND((60/$X32*Indtast!V$22),0)*$W$1+$B32,IF(Indtast!V23<>\"\",ROUND((60/$X32*Indtast!V$23),0)*$W$1+$B32,\"x\"))","v":"x"},{"$f":"IF(Indtast!W22<>\"\",ROUND((60/$X32*Indtast!W$22),0)*$W$1+$B32,IF(Indtast!W23<>\"\",ROUND((60/$X32*Indtast!W$23),0)*$W$1+$B32,\"x\"))","v":"x"},{"$f":"IF(Indtast!X22<>\"\",ROUND((60/$X32*Indtast!X$22),0)*$W$1+$B32,IF(Indtast!X23<>\"\",ROUND((60/$X32*Indtast!X$23),0)*$W$1+$B32,\"x\"))","v":"x"},{"$f":"IF(Indtast!Y22<>\"\",ROUND((60/$X32*Indtast!Y$22),0)*$W$1+$B32,IF(Indtast!Y23<>\"\",ROUND((60/$X32*Indtast!Y$23),0)*$W$1+$B32,\"x\"))","v":"x"},{"$f":"IF(Indtast!Z22<>\"\",ROUND((60/$X32*Indtast!Z$22),0)*$W$1+$B32,IF(Indtast!Z23<>\"\",ROUND((60/$X32*Indtast!Z$23),0)*$W$1+$B32,\"x\"))","v":"x"},{"$f":"IF(Indtast!AA22<>\"\",ROUND((60/$X32*Indtast!AA$22),0)*$W$1+$B32,IF(Indtast!AA23<>\"\",ROUND((60/$X32*Indtast!AA$23),0)*$W$1+$B32,\"x\"))","v":"x"},{"$f":"IF(Indtast!AB22<>\"\",ROUND((60/$X32*Indtast!AB$22),0)*$W$1+$B32,IF(Indtast!AB23<>\"\",ROUND((60/$X32*Indtast!AB$23),0)*$W$1+$B32,\"x\"))","v":"x"},null,{"$f":"Indtast!$E$22","v":43}]
[{"$f":"Indtast!A22&\" \"&Indtast!$D$2","v":"A Mel"},{"$f":"IF(Indtast!$B$22<>\"\",Indtast!$B$22,\"\")","v":"12:00:00"},{"$f":"IF(Indtast!I22<>\"\",ROUND((60/$X33*Indtast!I$22),0)*$W$1+$B33,IF(Indtast!I23<>\"\",ROUND((60/$X33*Indtast!I$23),0)*$W$1+$B33,\"x\"))","v":"12:15:00"},{"$f":"IF(Indtast!J22<>\"\",ROUND((60/$X33*Indtast!J$22),0)*$W$1+$B33,IF(Indtast!J23<>\"\",ROUND((60/$X33*Indtast!J$23),0)*$W$1+$B33,\"x\"))","v":"12:30:00"},{"$f":"IF(Indtast!K22<>\"\",ROUND((60/$X33*Indtast!K$22),0)*$W$1+$B33,IF(Indtast!K23<>\"\",ROUND((60/$X33*Indtast!K$23),0)*$W$1+$B33,\"x\"))","v":"12:45:00"},{"$f":"IF(Indtast!L22<>\"\",ROUND((60/$X33*Indtast!L$22),0)*$W$1+$B33,IF(Indtast!L23<>\"\",ROUND((60/$X33*Indtast!L$23),0)*$W$1+$B33,\"x\"))","v":"13:00:00"},{"$f":"IF(Indtast!M22<>\"\",ROUND((60/$X33*Indtast!M$22),0)*$W$1+$B33,IF(Indtast!M23<>\"\",ROUND((60/$X33*Indtast!M$23),0)*$W$1+$B33,\"x\"))","v":"13:15:00"},{"$f":"IF(Indtast!N22<>\"\",ROUND((60/$X33*Indtast!N$22),0)*$W$1+$B33,IF(Indtast!N23<>\"\",ROUND((60/$X33*Indtast!N$23),0)*$W$1+$B33,\"x\"))","v":"13:30:00"},{"$f":"IF(Indtast!O22<>\"\",ROUND((60/$X33*Indtast!O$22),0)*$W$1+$B33,IF(Indtast!O23<>\"\",ROUND((60/$X33*Indtast!O$23),0)*$W$1+$B33,\"x\"))","v":"13:45:00"},{"$f":"IF(Indtast!P22<>\"\",ROUND((60/$X33*Indtast!P$22),0)*$W$1+$B33,IF(Indtast!P23<>\"\",ROUND((60/$X33*Indtast!P$23),0)*$W$1+$B33,\"x\"))","v":"14:00:00"},{"$f":"IF(Indtast!Q22<>\"\",ROUND((60/$X33*Indtast!Q$22),0)*$W$1+$B33,IF(Indtast!Q23<>\"\",ROUND((60/$X33*Indtast!Q$23),0)*$W$1+$B33,\"x\"))","v":"14:15:00"},{"$f":"IF(Indtast!R22<>\"\",ROUND((60/$X33*Indtast!R$22),0)*$W$1+$B33,IF(Indtast!R23<>\"\",ROUND((60/$X33*Indtast!R$23),0)*$W$1+$B33,\"x\"))","v":"14:30:00"},{"$f":"IF(Indtast!S22<>\"\",ROUND((60/$X33*Indtast!S$22),0)*$W$1+$B33,IF(Indtast!S23<>\"\",ROUND((60/$X33*Indtast!S$23),0)*$W$1+$B33,\"x\"))","v":"14:45:00"},{"$f":"IF(Indtast!T22<>\"\",ROUND((60/$X33*Indtast!T$22),0)*$W$1+$B33,IF(Indtast!T23<>\"\",ROUND((60/$X33*Indtast!T$23),0)*$W$1+$B33,\"x\"))","v":"15:00:00"},{"$f":"IF(Indtast!U22<>\"\",ROUND((60/$X33*Indtast!U$22),0)*$W$1+$B33,IF(Indtast!U23<>\"\",ROUND((60/$X33*Indtast!U$23),0)*$W$1+$B33,\"x\"))","v":"x"},{"$f":"IF(Indtast!V22<>\"\",ROUND((60/$X33*Indtast!V$22),0)*$W$1+$B33,IF(Indtast!V23<>\"\",ROUND((60/$X33*Indtast!V$23),0)*$W$1+$B33,\"x\"))","v":"x"},{"$f":"IF(Indtast!W22<>\"\",ROUND((60/$X33*Indtast!W$22),0)*$W$1+$B33,IF(Indtast!W23<>\"\",ROUND((60/$X33*Indtast!W$23),0)*$W$1+$B33,\"x\"))","v":"x"},{"$f":"IF(Indtast!X22<>\"\",ROUND((60/$X33*Indtast!X$22),0)*$W$1+$B33,IF(Indtast!X23<>\"\",ROUND((60/$X33*Indtast!X$23),0)*$W$1+$B33,\"x\"))","v":"x"},{"$f":"IF(Indtast!Y22<>\"\",ROUND((60/$X33*Indtast!Y$22),0)*$W$1+$B33,IF(Indtast!Y23<>\"\",ROUND((60/$X33*Indtast!Y$23),0)*$W$1+$B33,\"x\"))","v":"x"},{"$f":"IF(Indtast!Z22<>\"\",ROUND((60/$X33*Indtast!Z$22),0)*$W$1+$B33,IF(Indtast!Z23<>\"\",ROUND((60/$X33*Indtast!Z$23),0)*$W$1+$B33,\"x\"))","v":"x"},{"$f":"IF(Indtast!AA22<>\"\",ROUND((60/$X33*Indtast!AA$22),0)*$W$1+$B33,IF(Indtast!AA23<>\"\",ROUND((60/$X33*Indtast!AA$23),0)*$W$1+$B33,\"x\"))","v":"x"},{"$f":"IF(Indtast!AB22<>\"\",ROUND((60/$X33*Indtast!AB$22),0)*$W$1+$B33,IF(Indtast!AB23<>\"\",ROUND((60/$X33*Indtast!AB$23),0)*$W$1+$B33,\"x\"))","v":"x"},null,{"$f":"Indtast!$D$22","v":44}]
[{"$f":"Indtast!A22&\" \"&Indtast!$C$2","v":"A Høj"},{"$f":"IF(Indtast!$B$22<>\"\",Indtast!$B$22,\"\")","v":"12:00:00"},{"$f":"IF(Indtast!I22<>\"\",ROUND((60/$X34*Indtast!I$22),0)*$W$1+$B34,IF(Indtast!I23<>\"\",ROUND((60/$X34*Indtast!I$23),0)*$W$1+$B34,\"x\"))","v":"12:15:00"},{"$f":"IF(Indtast!J22<>\"\",ROUND((60/$X34*Indtast!J$22),0)*$W$1+$B34,IF(Indtast!J23<>\"\",ROUND((60/$X34*Indtast!J$23),0)*$W$1+$B34,\"x\"))","v":"12:29:00"},{"$f":"IF(Indtast!K22<>\"\",ROUND((60/$X34*Indtast!K$22),0)*$W$1+$B34,IF(Indtast!K23<>\"\",ROUND((60/$X34*Indtast!K$23),0)*$W$1+$B34,\"x\"))","v":"12:44:00"},{"$f":"IF(Indtast!L22<>\"\",ROUND((60/$X34*Indtast!L$22),0)*$W$1+$B34,IF(Indtast!L23<>\"\",ROUND((60/$X34*Indtast!L$23),0)*$W$1+$B34,\"x\"))","v":"12:59:00"},{"$f":"IF(Indtast!M22<>\"\",ROUND((60/$X34*Indtast!M$22),0)*$W$1+$B34,IF(Indtast!M23<>\"\",ROUND((60/$X34*Indtast!M$23),0)*$W$1+$B34,\"x\"))","v":"13:13:00"},{"$f":"IF(Indtast!N22<>\"\",ROUND((60/$X34*Indtast!N$22),0)*$W$1+$B34,IF(Indtast!N23<>\"\",ROUND((60/$X34*Indtast!N$23),0)*$W$1+$B34,\"x\"))","v":"13:28:00"},{"$f":"IF(Indtast!O22<>\"\",ROUND((60/$X34*Indtast!O$22),0)*$W$1+$B34,IF(Indtast!O23<>\"\",ROUND((60/$X34*Indtast!O$23),0)*$W$1+$B34,\"x\"))","v":"13:43:00"},{"$f":"IF(Indtast!P22<>\"\",ROUND((60/$X34*Indtast!P$22),0)*$W$1+$B34,IF(Indtast!P23<>\"\",ROUND((60/$X34*Indtast!P$23),0)*$W$1+$B34,\"x\"))","v":"13:57:00"},{"$f":"IF(Indtast!Q22<>\"\",ROUND((60/$X34*Indtast!Q$22),0)*$W$1+$B34,IF(Indtast!Q23<>\"\",ROUND((60/$X34*Indtast!Q$23),0)*$W$1+$B34,\"x\"))","v":"14:12:00"},{"$f":"IF(Indtast!R22<>\"\",ROUND((60/$X34*Indtast!R$22),0)*$W$1+$B34,IF(Indtast!R23<>\"\",ROUND((60/$X34*Indtast!R$23),0)*$W$1+$B34,\"x\"))","v":"14:27:00"},{"$f":"IF(Indtast!S22<>\"\",ROUND((60/$X34*Indtast!S$22),0)*$W$1+$B34,IF(Indtast!S23<>\"\",ROUND((60/$X34*Indtast!S$23),0)*$W$1+$B34,\"x\"))","v":"14:41:00"},{"$f":"IF(Indtast!T22<>\"\",ROUND((60/$X34*Indtast!T$22),0)*$W$1+$B34,IF(Indtast!T23<>\"\",ROUND((60/$X34*Indtast!T$23),0)*$W$1+$B34,\"x\"))","v":"14:56:00"},{"$f":"IF(Indtast!U22<>\"\",ROUND((60/$X34*Indtast!U$22),0)*$W$1+$B34,IF(Indtast!U23<>\"\",ROUND((60/$X34*Indtast!U$23),0)*$W$1+$B34,\"x\"))","v":"x"},{"$f":"IF(Indtast!V22<>\"\",ROUND((60/$X34*Indtast!V$22),0)*$W$1+$B34,IF(Indtast!V23<>\"\",ROUND((60/$X34*Indtast!V$23),0)*$W$1+$B34,\"x\"))","v":"x"},{"$f":"IF(Indtast!W22<>\"\",ROUND((60/$X34*Indtast!W$22),0)*$W$1+$B34,IF(Indtast!W23<>\"\",ROUND((60/$X34*Indtast!W$23),0)*$W$1+$B34,\"x\"))","v":"x"},{"$f":"IF(Indtast!X22<>\"\",ROUND((60/$X34*Indtast!X$22),0)*$W$1+$B34,IF(Indtast!X23<>\"\",ROUND((60/$X34*Indtast!X$23),0)*$W$1+$B34,\"x\"))","v":"x"},{"$f":"IF(Indtast!Y22<>\"\",ROUND((60/$X34*Indtast!Y$22),0)*$W$1+$B34,IF(Indtast!Y23<>\"\",ROUND((60/$X34*Indtast!Y$23),0)*$W$1+$B34,\"x\"))","v":"x"},{"$f":"IF(Indtast!Z22<>\"\",ROUND((60/$X34*Indtast!Z$22),0)*$W$1+$B34,IF(Indtast!Z23<>\"\",ROUND((60/$X34*Indtast!Z$23),0)*$W$1+$B34,\"x\"))","v":"x"},{"$f":"IF(Indtast!AA22<>\"\",ROUND((60/$X34*Indtast!AA$22),0)*$W$1+$B34,IF(Indtast!AA23<>\"\",ROUND((60/$X34*Indtast!AA$23),0)*$W$1+$B34,\"x\"))","v":"x"},{"$f":"IF(Indtast!AB22<>\"\",ROUND((60/$X34*Indtast!AB$22),0)*$W$1+$B34,IF(Indtast!AB23<>\"\",ROUND((60/$X34*Indtast!AB$23),0)*$W$1+$B34,\"x\"))","v":"x"},null,{"$f":"Indtast!$C$22","v":45}]
[{"$f":"Indtast!A24&\" \"&Indtast!$E$2","v":"U19 Lav"},{"$f":"IF(Indtast!$B$24<>\"\",Indtast!$B$24,\"\")","v":"12:07:00"},{"$f":"IF(Indtast!I24<>\"\",ROUND((60/$X35*Indtast!I$24),0)*$W$1+$B35,IF(Indtast!I25<>\"\",ROUND((60/$X35*Indtast!I$25),0)*$W$1+$B35,\"x\"))","v":"12:24:00"},{"$f":"IF(Indtast!J24<>\"\",ROUND((60/$X35*Indtast!J$24),0)*$W$1+$B35,IF(Indtast!J25<>\"\",ROUND((60/$X35*Indtast!J$25),0)*$W$1+$B35,\"x\"))","v":"12:40:00"},{"$f":"IF(Indtast!K24<>\"\",ROUND((60/$X35*Indtast!K$24),0)*$W$1+$B35,IF(Indtast!K25<>\"\",ROUND((60/$X35*Indtast!K$25),0)*$W$1+$B35,\"x\"))","v":"12:57:00"},{"$f":"IF(Indtast!L24<>\"\",ROUND((60/$X35*Indtast!L$24),0)*$W$1+$B35,IF(Indtast!L25<>\"\",ROUND((60/$X35*Indtast!L$25),0)*$W$1+$B35,\"x\"))","v":"13:13:00"},{"$f":"IF(Indtast!M24<>\"\",ROUND((60/$X35*Indtast!M$24),0)*$W$1+$B35,IF(Indtast!M25<>\"\",ROUND((60/$X35*Indtast!M$25),0)*$W$1+$B35,\"x\"))","v":"13:30:00"},{"$f":"IF(Indtast!N24<>\"\",ROUND((60/$X35*Indtast!N$24),0)*$W$1+$B35,IF(Indtast!N25<>\"\",ROUND((60/$X35*Indtast!N$25),0)*$W$1+$B35,\"x\"))","v":"13:46:00"},{"$f":"IF(Indtast!O24<>\"\",ROUND((60/$X35*Indtast!O$24),0)*$W$1+$B35,IF(Indtast!O25<>\"\",ROUND((60/$X35*Indtast!O$25),0)*$W$1+$B35,\"x\"))","v":"14:03:00"},{"$f":"IF(Indtast!P24<>\"\",ROUND((60/$X35*Indtast!P$24),0)*$W$1+$B35,IF(Indtast!P25<>\"\",ROUND((60/$X35*Indtast!P$25),0)*$W$1+$B35,\"x\"))","v":"14:19:00"},{"$f":"IF(Indtast!Q24<>\"\",ROUND((60/$X35*Indtast!Q$24),0)*$W$1+$B35,IF(Indtast!Q25<>\"\",ROUND((60/$X35*Indtast!Q$25),0)*$W$1+$B35,\"x\"))","v":"x"},{"$f":"IF(Indtast!R24<>\"\",ROUND((60/$X35*Indtast!R$24),0)*$W$1+$B35,IF(Indtast!R25<>\"\",ROUND((60/$X35*Indtast!R$25),0)*$W$1+$B35,\"x\"))","v":"x"},{"$f":"IF(Indtast!S24<>\"\",ROUND((60/$X35*Indtast!S$24),0)*$W$1+$B35,IF(Indtast!S25<>\"\",ROUND((60/$X35*Indtast!S$25),0)*$W$1+$B35,\"x\"))","v":"x"},{"$f":"IF(Indtast!T24<>\"\",ROUND((60/$X35*Indtast!T$24),0)*$W$1+$B35,IF(Indtast!T25<>\"\",ROUND((60/$X35*Indtast!T$25),0)*$W$1+$B35,\"x\"))","v":"x"},{"$f":"IF(Indtast!U24<>\"\",ROUND((60/$X35*Indtast!U$24),0)*$W$1+$B35,IF(Indtast!U25<>\"\",ROUND((60/$X35*Indtast!U$25),0)*$W$1+$B35,\"x\"))","v":"x"},{"$f":"IF(Indtast!V24<>\"\",ROUND((60/$X35*Indtast!V$24),0)*$W$1+$B35,IF(Indtast!V25<>\"\",ROUND((60/$X35*Indtast!V$25),0)*$W$1+$B35,\"x\"))","v":"x"},{"$f":"IF(Indtast!W24<>\"\",ROUND((60/$X35*Indtast!W$24),0)*$W$1+$B35,IF(Indtast!W25<>\"\",ROUND((60/$X35*Indtast!W$25),0)*$W$1+$B35,\"x\"))","v":"x"},{"$f":"IF(Indtast!X24<>\"\",ROUND((60/$X35*Indtast!X$24),0)*$W$1+$B35,IF(Indtast!X25<>\"\",ROUND((60/$X35*Indtast!X$25),0)*$W$1+$B35,\"x\"))","v":"x"},{"$f":"IF(Indtast!Y24<>\"\",ROUND((60/$X35*Indtast!Y$24),0)*$W$1+$B35,IF(Indtast!Y25<>\"\",ROUND((60/$X35*Indtast!Y$25),0)*$W$1+$B35,\"x\"))","v":"x"},{"$f":"IF(Indtast!Z24<>\"\",ROUND((60/$X35*Indtast!Z$24),0)*$W$1+$B35,IF(Indtast!Z25<>\"\",ROUND((60/$X35*Indtast!Z$25),0)*$W$1+$B35,\"x\"))","v":"x"},{"$f":"IF(Indtast!AA24<>\"\",ROUND((60/$X35*Indtast!AA$24),0)*$W$1+$B35,IF(Indtast!AA25<>\"\",ROUND((60/$X35*Indtast!AA$25),0)*$W$1+$B35,\"x\"))","v":"x"},{"$f":"IF(Indtast!AB24<>\"\",ROUND((60/$X35*Indtast!AB$24),0)*$W$1+$B35,IF(Indtast!AB25<>\"\",ROUND((60/$X35*Indtast!AB$25),0)*$W$1+$B35,\"x\"))","v":"x"},null,{"$f":"Indtast!$E$24","v":40}]
[{"$f":"Indtast!$A24&\" \"&Indtast!$D$2","v":"U19 Mel"},{"$f":"IF(Indtast!$B$24<>\"\",Indtast!$B$24,\"\")","v":"12:07:00"},{"$f":"IF(Indtast!I24<>\"\",ROUND((60/$X36*Indtast!I$24),0)*$W$1+$B36,IF(Indtast!I25<>\"\",ROUND((60/$X36*Indtast!I$25),0)*$W$1+$B36,\"x\"))","v":"12:23:00"},{"$f":"IF(Indtast!J24<>\"\",ROUND((60/$X36*Indtast!J$24),0)*$W$1+$B36,IF(Indtast!J25<>\"\",ROUND((60/$X36*Indtast!J$25),0)*$W$1+$B36,\"x\"))","v":"12:39:00"},{"$f":"IF(Indtast!K24<>\"\",ROUND((60/$X36*Indtast!K$24),0)*$W$1+$B36,IF(Indtast!K25<>\"\",ROUND((60/$X36*Indtast!K$25),0)*$W$1+$B36,\"x\"))","v":"12:55:00"},{"$f":"IF(Indtast!L24<>\"\",ROUND((60/$X36*Indtast!L$24),0)*$W$1+$B36,IF(Indtast!L25<>\"\",ROUND((60/$X36*Indtast!L$25),0)*$W$1+$B36,\"x\"))","v":"13:11:00"},{"$f":"IF(Indtast!M24<>\"\",ROUND((60/$X36*Indtast!M$24),0)*$W$1+$B36,IF(Indtast!M25<>\"\",ROUND((60/$X36*Indtast!M$25),0)*$W$1+$B36,\"x\"))","v":"13:27:00"},{"$f":"IF(Indtast!N24<>\"\",ROUND((60/$X36*Indtast!N$24),0)*$W$1+$B36,IF(Indtast!N25<>\"\",ROUND((60/$X36*Indtast!N$25),0)*$W$1+$B36,\"x\"))","v":"13:44:00"},{"$f":"IF(Indtast!O24<>\"\",ROUND((60/$X36*Indtast!O$24),0)*$W$1+$B36,IF(Indtast!O25<>\"\",ROUND((60/$X36*Indtast!O$25),0)*$W$1+$B36,\"x\"))","v":"14:00:00"},{"$f":"IF(Indtast!P24<>\"\",ROUND((60/$X36*Indtast!P$24),0)*$W$1+$B36,IF(Indtast!P25<>\"\",ROUND((60/$X36*Indtast!P$25),0)*$W$1+$B36,\"x\"))","v":"14:16:00"},{"$f":"IF(Indtast!Q24<>\"\",ROUND((60/$X36*Indtast!Q$24),0)*$W$1+$B36,IF(Indtast!Q25<>\"\",ROUND((60/$X36*Indtast!Q$25),0)*$W$1+$B36,\"x\"))","v":"x"},{"$f":"IF(Indtast!R24<>\"\",ROUND((60/$X36*Indtast!R$24),0)*$W$1+$B36,IF(Indtast!R25<>\"\",ROUND((60/$X36*Indtast!R$25),0)*$W$1+$B36,\"x\"))","v":"x"},{"$f":"IF(Indtast!S24<>\"\",ROUND((60/$X36*Indtast!S$24),0)*$W$1+$B36,IF(Indtast!S25<>\"\",ROUND((60/$X36*Indtast!S$25),0)*$W$1+$B36,\"x\"))","v":"x"},{"$f":"IF(Indtast!T24<>\"\",ROUND((60/$X36*Indtast!T$24),0)*$W$1+$B36,IF(Indtast!T25<>\"\",ROUND((60/$X36*Indtast!T$25),0)*$W$1+$B36,\"x\"))","v":"x"},{"$f":"IF(Indtast!U24<>\"\",ROUND((60/$X36*Indtast!U$24),0)*$W$1+$B36,IF(Indtast!U25<>\"\",ROUND((60/$X36*Indtast!U$25),0)*$W$1+$B36,\"x\"))","v":"x"},{"$f":"IF(Indtast!V24<>\"\",ROUND((60/$X36*Indtast!V$24),0)*$W$1+$B36,IF(Indtast!V25<>\"\",ROUND((60/$X36*Indtast!V$25),0)*$W$1+$B36,\"x\"))","v":"x"},{"$f":"IF(Indtast!W24<>\"\",ROUND((60/$X36*Indtast!W$24),0)*$W$1+$B36,IF(Indtast!W25<>\"\",ROUND((60/$X36*Indtast!W$25),0)*$W$1+$B36,\"x\"))","v":"x"},{"$f":"IF(Indtast!X24<>\"\",ROUND((60/$X36*Indtast!X$24),0)*$W$1+$B36,IF(Indtast!X25<>\"\",ROUND((60/$X36*Indtast!X$25),0)*$W$1+$B36,\"x\"))","v":"x"},{"$f":"IF(Indtast!Y24<>\"\",ROUND((60/$X36*Indtast!Y$24),0)*$W$1+$B36,IF(Indtast!Y25<>\"\",ROUND((60/$X36*Indtast!Y$25),0)*$W$1+$B36,\"x\"))","v":"x"},{"$f":"IF(Indtast!Z24<>\"\",ROUND((60/$X36*Indtast!Z$24),0)*$W$1+$B36,IF(Indtast!Z25<>\"\",ROUND((60/$X36*Indtast!Z$25),0)*$W$1+$B36,\"x\"))","v":"x"},{"$f":"IF(Indtast!AA24<>\"\",ROUND((60/$X36*Indtast!AA$24),0)*$W$1+$B36,IF(Indtast!AA25<>\"\",ROUND((60/$X36*Indtast!AA$25),0)*$W$1+$B36,\"x\"))","v":"x"},{"$f":"IF(Indtast!AB24<>\"\",ROUND((60/$X36*Indtast!AB$24),0)*$W$1+$B36,IF(Indtast!AB25<>\"\",ROUND((60/$X36*Indtast!AB$25),0)*$W$1+$B36,\"x\"))","v":"x"},null,{"$f":"Indtast!$D$24","v":41}]
[{"$f":"Indtast!A24&\" \"&Indtast!$C$2","v":"U19 Høj"},{"$f":"IF(Indtast!$B$24<>\"\",Indtast!$B$24,\"\")","v":"12:07:00"},{"$f":"IF(Indtast!I24<>\"\",ROUND((60/$X37*Indtast!I$24),0)*$W$1+$B37,IF(Indtast!I25<>\"\",ROUND((60/$X37*Indtast!I$25),0)*$W$1+$B37,\"x\"))","v":"12:23:00"},{"$f":"IF(Indtast!J24<>\"\",ROUND((60/$X37*Indtast!J$24),0)*$W$1+$B37,IF(Indtast!J25<>\"\",ROUND((60/$X37*Indtast!J$25),0)*$W$1+$B37,\"x\"))","v":"12:38:00"},{"$f":"IF(Indtast!K24<>\"\",ROUND((60/$X37*Indtast!K$24),0)*$W$1+$B37,IF(Indtast!K25<>\"\",ROUND((60/$X37*Indtast!K$25),0)*$W$1+$B37,\"x\"))","v":"12:54:00"},{"$f":"IF(Indtast!L24<>\"\",ROUND((60/$X37*Indtast!L$24),0)*$W$1+$B37,IF(Indtast!L25<>\"\",ROUND((60/$X37*Indtast!L$25),0)*$W$1+$B37,\"x\"))","v":"13:10:00"},{"$f":"IF(Indtast!M24<>\"\",ROUND((60/$X37*Indtast!M$24),0)*$W$1+$B37,IF(Indtast!M25<>\"\",ROUND((60/$X37*Indtast!M$25),0)*$W$1+$B37,\"x\"))","v":"13:26:00"},{"$f":"IF(Indtast!N24<>\"\",ROUND((60/$X37*Indtast!N$24),0)*$W$1+$B37,IF(Indtast!N25<>\"\",ROUND((60/$X37*Indtast!N$25),0)*$W$1+$B37,\"x\"))","v":"13:41:00"},{"$f":"IF(Indtast!O24<>\"\",ROUND((60/$X37*Indtast!O$24),0)*$W$1+$B37,IF(Indtast!O25<>\"\",ROUND((60/$X37*Indtast!O$25),0)*$W$1+$B37,\"x\"))","v":"13:57:00"},{"$f":"IF(Indtast!P24<>\"\",ROUND((60/$X37*Indtast!P$24),0)*$W$1+$B37,IF(Indtast!P25<>\"\",ROUND((60/$X37*Indtast!P$25),0)*$W$1+$B37,\"x\"))","v":"14:13:00"},{"$f":"IF(Indtast!Q24<>\"\",ROUND((60/$X37*Indtast!Q$24),0)*$W$1+$B37,IF(Indtast!Q25<>\"\",ROUND((60/$X37*Indtast!Q$25),0)*$W$1+$B37,\"x\"))","v":"x"},{"$f":"IF(Indtast!R24<>\"\",ROUND((60/$X37*Indtast!R$24),0)*$W$1+$B37,IF(Indtast!R25<>\"\",ROUND((60/$X37*Indtast!R$25),0)*$W$1+$B37,\"x\"))","v":"x"},{"$f":"IF(Indtast!S24<>\"\",ROUND((60/$X37*Indtast!S$24),0)*$W$1+$B37,IF(Indtast!S25<>\"\",ROUND((60/$X37*Indtast!S$25),0)*$W$1+$B37,\"x\"))","v":"x"},{"$f":"IF(Indtast!T24<>\"\",ROUND((60/$X37*Indtast!T$24),0)*$W$1+$B37,IF(Indtast!T25<>\"\",ROUND((60/$X37*Indtast!T$25),0)*$W$1+$B37,\"x\"))","v":"x"},{"$f":"IF(Indtast!U24<>\"\",ROUND((60/$X37*Indtast!U$24),0)*$W$1+$B37,IF(Indtast!U25<>\"\",ROUND((60/$X37*Indtast!U$25),0)*$W$1+$B37,\"x\"))","v":"x"},{"$f":"IF(Indtast!V24<>\"\",ROUND((60/$X37*Indtast!V$24),0)*$W$1+$B37,IF(Indtast!V25<>\"\",ROUND((60/$X37*Indtast!V$25),0)*$W$1+$B37,\"x\"))","v":"x"},{"$f":"IF(Indtast!W24<>\"\",ROUND((60/$X37*Indtast!W$24),0)*$W$1+$B37,IF(Indtast!W25<>\"\",ROUND((60/$X37*Indtast!W$25),0)*$W$1+$B37,\"x\"))","v":"x"},{"$f":"IF(Indtast!X24<>\"\",ROUND((60/$X37*Indtast!X$24),0)*$W$1+$B37,IF(Indtast!X25<>\"\",ROUND((60/$X37*Indtast!X$25),0)*$W$1+$B37,\"x\"))","v":"x"},{"$f":"IF(Indtast!Y24<>\"\",ROUND((60/$X37*Indtast!Y$24),0)*$W$1+$B37,IF(Indtast!Y25<>\"\",ROUND((60/$X37*Indtast!Y$25),0)*$W$1+$B37,\"x\"))","v":"x"},{"$f":"IF(Indtast!Z24<>\"\",ROUND((60/$X37*Indtast!Z$24),0)*$W$1+$B37,IF(Indtast!Z25<>\"\",ROUND((60/$X37*Indtast!Z$25),0)*$W$1+$B37,\"x\"))","v":"x"},{"$f":"IF(Indtast!AA24<>\"\",ROUND((60/$X37*Indtast!AA$24),0)*$W$1+$B37,IF(Indtast!AA25<>\"\",ROUND((60/$X37*Indtast!AA$25),0)*$W$1+$B37,\"x\"))","v":"x"},{"$f":"IF(Indtast!AB24<>\"\",ROUND((60/$X37*Indtast!AB$24),0)*$W$1+$B37,IF(Indtast!AB25<>\"\",ROUND((60/$X37*Indtast!AB$25),0)*$W$1+$B37,\"x\"))","v":"x"},null,{"$f":"Indtast!$C$24","v":42}]
[{"$f":"Indtast!$A30&\" \"&Indtast!$E$2","v":"D Lav"},{"$f":"IF(Indtast!$B$30<>\"\",Indtast!$B$30,\"\")","v":""},{"$f":"IF(Indtast!I30<>\"\",ROUND((60/$X38*Indtast!I$30),0)*$W$1+$B38,IF(Indtast!I31<>\"\",ROUND((60/$X38*Indtast!I$31),0)*$W$1+$B38,\"x\"))","v":"x"},{"$f":"IF(Indtast!J30<>\"\",ROUND((60/$X38*Indtast!J$30),0)*$W$1+$B38,IF(Indtast!J31<>\"\",ROUND((60/$X38*Indtast!J$31),0)*$W$1+$B38,\"x\"))","v":"x"},{"$f":"IF(Indtast!K30<>\"\",ROUND((60/$X38*Indtast!K$30),0)*$W$1+$B38,IF(Indtast!K31<>\"\",ROUND((60/$X38*Indtast!K$31),0)*$W$1+$B38,\"x\"))","v":"x"},{"$f":"IF(Indtast!L30<>\"\",ROUND((60/$X38*Indtast!L$30),0)*$W$1+$B38,IF(Indtast!O31<>\"\",ROUND((60/$X38*Indtast!O$31),0)*$W$1+$B38,\"x\"))","v":"x"},{"$f":"IF(Indtast!M30<>\"\",ROUND((60/$X38*Indtast!M$30),0)*$W$1+$B38,IF(Indtast!P31<>\"\",ROUND((60/$X38*Indtast!P$31),0)*$W$1+$B38,\"x\"))","v":"x"},{"$f":"IF(Indtast!N30<>\"\",ROUND((60/$X38*Indtast!N$30),0)*$W$1+$B38,IF(Indtast!N31<>\"\",ROUND((60/$X38*Indtast!N$31),0)*$W$1+$B38,\"x\"))","v":"x"},{"$f":"IF(Indtast!O30<>\"\",ROUND((60/$X38*Indtast!O$30),0)*$W$1+$B38,IF(Indtast!O31<>\"\",ROUND((60/$X38*Indtast!O$31),0)*$W$1+$B38,\"x\"))","v":"x"},{"$f":"IF(Indtast!P30<>\"\",ROUND((60/$X38*Indtast!P$30),0)*$W$1+$B38,IF(Indtast!P31<>\"\",ROUND((60/$X38*Indtast!P$31),0)*$W$1+$B38,\"x\"))","v":"x"},{"$f":"IF(Indtast!Q30<>\"\",ROUND((60/$X38*Indtast!Q$30),0)*$W$1+$B38,IF(Indtast!Q31<>\"\",ROUND((60/$X38*Indtast!Q$31),0)*$W$1+$B38,\"x\"))","v":"x"},{"$f":"IF(Indtast!R30<>\"\",ROUND((60/$X38*Indtast!R$30),0)*$W$1+$B38,IF(Indtast!R31<>\"\",ROUND((60/$X38*Indtast!R$31),0)*$W$1+$B38,\"x\"))","v":"x"},{"$f":"IF(Indtast!S30<>\"\",ROUND((60/$X38*Indtast!S$30),0)*$W$1+$B38,IF(Indtast!S31<>\"\",ROUND((60/$X38*Indtast!S$31),0)*$W$1+$B38,\"x\"))","v":"x"},{"$f":"IF(Indtast!T30<>\"\",ROUND((60/$X38*Indtast!T$30),0)*$W$1+$B38,IF(Indtast!T31<>\"\",ROUND((60/$X38*Indtast!T$31),0)*$W$1+$B38,\"x\"))","v":"x"},{"$f":"IF(Indtast!U30<>\"\",ROUND((60/$X38*Indtast!U$30),0)*$W$1+$B38,IF(Indtast!U31<>\"\",ROUND((60/$X38*Indtast!U$31),0)*$W$1+$B38,\"x\"))","v":"x"},{"$f":"IF(Indtast!V30<>\"\",ROUND((60/$X38*Indtast!V$30),0)*$W$1+$B38,IF(Indtast!V31<>\"\",ROUND((60/$X38*Indtast!V$31),0)*$W$1+$B38,\"x\"))","v":"x"},{"$f":"IF(Indtast!W30<>\"\",ROUND((60/$X38*Indtast!W$30),0)*$W$1+$B38,IF(Indtast!W31<>\"\",ROUND((60/$X38*Indtast!W$31),0)*$W$1+$B38,\"x\"))","v":"x"},{"$f":"IF(Indtast!X30<>\"\",ROUND((60/$X38*Indtast!X$30),0)*$W$1+$B38,IF(Indtast!X31<>\"\",ROUND((60/$X38*Indtast!X$31),0)*$W$1+$B38,\"x\"))","v":"x"},{"$f":"IF(Indtast!Y30<>\"\",ROUND((60/$X38*Indtast!Y$30),0)*$W$1+$B38,IF(Indtast!Y31<>\"\",ROUND((60/$X38*Indtast!Y$31),0)*$W$1+$B38,\"x\"))","v":"x"},{"$f":"IF(Indtast!Z30<>\"\",ROUND((60/$X38*Indtast!Z$30),0)*$W$1+$B38,IF(Indtast!Z31<>\"\",ROUND((60/$X38*Indtast!Z$31),0)*$W$1+$B38,\"x\"))","v":"x"},{"$f":"IF(Indtast!AA30<>\"\",ROUND((60/$X38*Indtast!AA$30),0)*$W$1+$B38,IF(Indtast!AA31<>\"\",ROUND((60/$X38*Indtast!AA$31),0)*$W$1+$B38,\"x\"))","v":"x"},{"$f":"IF(Indtast!AB30<>\"\",ROUND((60/$X38*Indtast!AB$30),0)*$W$1+$B38,IF(Indtast!AB31<>\"\",ROUND((60/$X38*Indtast!AB$31),0)*$W$1+$B38,\"x\"))","v":"x"},null,{"$f":"Indtast!$E$30","v":0}]
[{"$f":"Indtast!A30&\" \"&Indtast!$D$2","v":"D Mel"},{"$f":"IF(Indtast!$B$30<>\"\",Indtast!$B$30,\"\")","v":""},{"$f":"IF(Indtast!I30<>\"\",ROUND((60/$X39*Indtast!I$30),0)*$W$1+$B39,IF(Indtast!I31<>\"\",ROUND((60/$X39*Indtast!I$31),0)*$W$1+$B39,\"x\"))","v":"x"},{"$f":"IF(Indtast!J30<>\"\",ROUND((60/$X39*Indtast!J$30),0)*$W$1+$B39,IF(Indtast!J31<>\"\",ROUND((60/$X39*Indtast!J$31),0)*$W$1+$B39,\"x\"))","v":"x"},{"$f":"IF(Indtast!K30<>\"\",ROUND((60/$X39*Indtast!K$30),0)*$W$1+$B39,IF(Indtast!K31<>\"\",ROUND((60/$X39*Indtast!K$31),0)*$W$1+$B39,\"x\"))","v":"x"},{"$f":"IF(Indtast!L30<>\"\",ROUND((60/$X39*Indtast!L$30),0)*$W$1+$B39,IF(Indtast!O31<>\"\",ROUND((60/$X39*Indtast!O$31),0)*$W$1+$B39,\"x\"))","v":"x"},{"$f":"IF(Indtast!M30<>\"\",ROUND((60/$X39*Indtast!M$30),0)*$W$1+$B39,IF(Indtast!P31<>\"\",ROUND((60/$X39*Indtast!P$31),0)*$W$1+$B39,\"x\"))","v":"x"},{"$f":"IF(Indtast!N30<>\"\",ROUND((60/$X39*Indtast!N$30),0)*$W$1+$B39,IF(Indtast!N31<>\"\",ROUND((60/$X39*Indtast!N$31),0)*$W$1+$B39,\"x\"))","v":"x"},{"$f":"IF(Indtast!O30<>\"\",ROUND((60/$X39*Indtast!O$30),0)*$W$1+$B39,IF(Indtast!O31<>\"\",ROUND((60/$X39*Indtast!O$31),0)*$W$1+$B39,\"x\"))","v":"x"},{"$f":"IF(Indtast!P30<>\"\",ROUND((60/$X39*Indtast!P$30),0)*$W$1+$B39,IF(Indtast!P31<>\"\",ROUND((60/$X39*Indtast!P$31),0)*$W$1+$B39,\"x\"))","v":"x"},{"$f":"IF(Indtast!Q30<>\"\",ROUND((60/$X39*Indtast!Q$30),0)*$W$1+$B39,IF(Indtast!Q31<>\"\",ROUND((60/$X39*Indtast!Q$31),0)*$W$1+$B39,\"x\"))","v":"x"},{"$f":"IF(Indtast!R30<>\"\",ROUND((60/$X39*Indtast!R$30),0)*$W$1+$B39,IF(Indtast!R31<>\"\",ROUND((60/$X39*Indtast!R$31),0)*$W$1+$B39,\"x\"))","v":"x"},{"$f":"IF(Indtast!S30<>\"\",ROUND((60/$X39*Indtast!S$30),0)*$W$1+$B39,IF(Indtast!S31<>\"\",ROUND((60/$X39*Indtast!S$31),0)*$W$1+$B39,\"x\"))","v":"x"},{"$f":"IF(Indtast!T30<>\"\",ROUND((60/$X39*Indtast!T$30),0)*$W$1+$B39,IF(Indtast!T31<>\"\",ROUND((60/$X39*Indtast!T$31),0)*$W$1+$B39,\"x\"))","v":"x"},{"$f":"IF(Indtast!U30<>\"\",ROUND((60/$X39*Indtast!U$30),0)*$W$1+$B39,IF(Indtast!U31<>\"\",ROUND((60/$X39*Indtast!U$31),0)*$W$1+$B39,\"x\"))","v":"x"},{"$f":"IF(Indtast!V30<>\"\",ROUND((60/$X39*Indtast!V$30),0)*$W$1+$B39,IF(Indtast!V31<>\"\",ROUND((60/$X39*Indtast!V$31),0)*$W$1+$B39,\"x\"))","v":"x"},{"$f":"IF(Indtast!W30<>\"\",ROUND((60/$X39*Indtast!W$30),0)*$W$1+$B39,IF(Indtast!W31<>\"\",ROUND((60/$X39*Indtast!W$31),0)*$W$1+$B39,\"x\"))","v":"x"},{"$f":"IF(Indtast!X30<>\"\",ROUND((60/$X39*Indtast!X$30),0)*$W$1+$B39,IF(Indtast!X31<>\"\",ROUND((60/$X39*Indtast!X$31),0)*$W$1+$B39,\"x\"))","v":"x"},{"$f":"IF(Indtast!Y30<>\"\",ROUND((60/$X39*Indtast!Y$30),0)*$W$1+$B39,IF(Indtast!Y31<>\"\",ROUND((60/$X39*Indtast!Y$31),0)*$W$1+$B39,\"x\"))","v":"x"},{"$f":"IF(Indtast!Z30<>\"\",ROUND((60/$X39*Indtast!Z$30),0)*$W$1+$B39,IF(Indtast!Z31<>\"\",ROUND((60/$X39*Indtast!Z$31),0)*$W$1+$B39,\"x\"))","v":"x"},{"$f":"IF(Indtast!AA30<>\"\",ROUND((60/$X39*Indtast!AA$30),0)*$W$1+$B39,IF(Indtast!AA31<>\"\",ROUND((60/$X39*Indtast!AA$31),0)*$W$1+$B39,\"x\"))","v":"x"},{"$f":"IF(Indtast!AB30<>\"\",ROUND((60/$X39*Indtast!AB$30),0)*$W$1+$B39,IF(Indtast!AB31<>\"\",ROUND((60/$X39*Indtast!AB$31),0)*$W$1+$B39,\"x\"))","v":"x"},null,{"$f":"Indtast!$D$30","v":0}]
[{"$f":"Indtast!A30&\" \"&Indtast!$C$2","v":"D Høj"},{"$f":"IF(Indtast!$B$30<>\"\",Indtast!$B$30,\"\")","v":""},{"$f":"IF(Indtast!I30<>\"\",ROUND((60/$X40*Indtast!I$30),0)*$W$1+$B40,IF(Indtast!I31<>\"\",ROUND((60/$X40*Indtast!I$31),0)*$W$1+$B40,\"x\"))","v":"x"},{"$f":"IF(Indtast!J30<>\"\",ROUND((60/$X40*Indtast!J$30),0)*$W$1+$B40,IF(Indtast!J31<>\"\",ROUND((60/$X40*Indtast!J$31),0)*$W$1+$B40,\"x\"))","v":"x"},{"$f":"IF(Indtast!K30<>\"\",ROUND((60/$X40*Indtast!K$30),0)*$W$1+$B40,IF(Indtast!K31<>\"\",ROUND((60/$X40*Indtast!K$31),0)*$W$1+$B40,\"x\"))","v":"x"},{"$f":"IF(Indtast!L30<>\"\",ROUND((60/$X40*Indtast!L$30),0)*$W$1+$B40,IF(Indtast!O31<>\"\",ROUND((60/$X40*Indtast!O$31),0)*$W$1+$B40,\"x\"))","v":"x"},{"$f":"IF(Indtast!M30<>\"\",ROUND((60/$X40*Indtast!M$30),0)*$W$1+$B40,IF(Indtast!P31<>\"\",ROUND((60/$X40*Indtast!P$31),0)*$W$1+$B40,\"x\"))","v":"x"},{"$f":"IF(Indtast!N30<>\"\",ROUND((60/$X40*Indtast!N$30),0)*$W$1+$B40,IF(Indtast!N31<>\"\",ROUND((60/$X40*Indtast!N$31),0)*$W$1+$B40,\"x\"))","v":"x"},{"$f":"IF(Indtast!O30<>\"\",ROUND((60/$X40*Indtast!O$30),0)*$W$1+$B40,IF(Indtast!O31<>\"\",ROUND((60/$X40*Indtast!O$31),0)*$W$1+$B40,\"x\"))","v":"x"},{"$f":"IF(Indtast!P30<>\"\",ROUND((60/$X40*Indtast!P$30),0)*$W$1+$B40,IF(Indtast!P31<>\"\",ROUND((60/$X40*Indtast!P$31),0)*$W$1+$B40,\"x\"))","v":"x"},{"$f":"IF(Indtast!Q30<>\"\",ROUND((60/$X40*Indtast!Q$30),0)*$W$1+$B40,IF(Indtast!Q31<>\"\",ROUND((60/$X40*Indtast!Q$31),0)*$W$1+$B40,\"x\"))","v":"x"},{"$f":"IF(Indtast!R30<>\"\",ROUND((60/$X40*Indtast!R$30),0)*$W$1+$B40,IF(Indtast!R31<>\"\",ROUND((60/$X40*Indtast!R$31),0)*$W$1+$B40,\"x\"))","v":"x"},{"$f":"IF(Indtast!S30<>\"\",ROUND((60/$X40*Indtast!S$30),0)*$W$1+$B40,IF(Indtast!S31<>\"\",ROUND((60/$X40*Indtast!S$31),0)*$W$1+$B40,\"x\"))","v":"x"},{"$f":"IF(Indtast!T30<>\"\",ROUND((60/$X40*Indtast!T$30),0)*$W$1+$B40,IF(Indtast!T31<>\"\",ROUND((60/$X40*Indtast!T$31),0)*$W$1+$B40,\"x\"))","v":"x"},{"$f":"IF(Indtast!U30<>\"\",ROUND((60/$X40*Indtast!U$30),0)*$W$1+$B40,IF(Indtast!U31<>\"\",ROUND((60/$X40*Indtast!U$31),0)*$W$1+$B40,\"x\"))","v":"x"},{"$f":"IF(Indtast!V30<>\"\",ROUND((60/$X40*Indtast!V$30),0)*$W$1+$B40,IF(Indtast!V31<>\"\",ROUND((60/$X40*Indtast!V$31),0)*$W$1+$B40,\"x\"))","v":"x"},{"$f":"IF(Indtast!W30<>\"\",ROUND((60/$X40*Indtast!W$30),0)*$W$1+$B40,IF(Indtast!W31<>\"\",ROUND((60/$X40*Indtast!W$31),0)*$W$1+$B40,\"x\"))","v":"x"},{"$f":"IF(Indtast!X30<>\"\",ROUND((60/$X40*Indtast!X$30),0)*$W$1+$B40,IF(Indtast!X31<>\"\",ROUND((60/$X40*Indtast!X$31),0)*$W$1+$B40,\"x\"))","v":"x"},{"$f":"IF(Indtast!Y30<>\"\",ROUND((60/$X40*Indtast!Y$30),0)*$W$1+$B40,IF(Indtast!Y31<>\"\",ROUND((60/$X40*Indtast!Y$31),0)*$W$1+$B40,\"x\"))","v":"x"},{"$f":"IF(Indtast!Z30<>\"\",ROUND((60/$X40*Indtast!Z$30),0)*$W$1+$B40,IF(Indtast!Z31<>\"\",ROUND((60/$X40*Indtast!Z$31),0)*$W$1+$B40,\"x\"))","v":"x"},{"$f":"IF(Indtast!AA30<>\"\",ROUND((60/$X40*Indtast!AA$30),0)*$W$1+$B40,IF(Indtast!AA31<>\"\",ROUND((60/$X40*Indtast!AA$31),0)*$W$1+$B40,\"x\"))","v":"x"},{"$f":"IF(Indtast!AB30<>\"\",ROUND((60/$X40*Indtast!AB$30),0)*$W$1+$B40,IF(Indtast!AB31<>\"\",ROUND((60/$X40*Indtast!AB$31),0)*$W$1+$B40,\"x\"))","v":"x"},null,{"$f":"Indtast!$C$30","v":0}]
[{"$f":"Indtast!$A26&\" \"&Indtast!$E$2","v":"B Lav"},{"$f":"IF(Indtast!$B$26<>\"\",Indtast!$B$26,\"\")","v":""},{"$f":"IF(Indtast!I26<>\"\",ROUND((60/$X41*Indtast!I$26),0)*$W$1+$B41,IF(Indtast!I27<>\"\",ROUND((60/$X41*Indtast!I$27),0)*$W$1+$B41,\"x\"))","v":"x"},{"$f":"IF(Indtast!J26<>\"\",ROUND((60/$X41*Indtast!J$26),0)*$W$1+$B41,IF(Indtast!J27<>\"\",ROUND((60/$X41*Indtast!J$27),0)*$W$1+$B41,\"x\"))","v":"x"},{"$f":"IF(Indtast!K26<>\"\",ROUND((60/$X41*Indtast!K$26),0)*$W$1+$B41,IF(Indtast!K27<>\"\",ROUND((60/$X41*Indtast!K$27),0)*$W$1+$B41,\"x\"))","v":"x"},{"$f":"IF(Indtast!L26<>\"\",ROUND((60/$X41*Indtast!L$26),0)*$W$1+$B41,IF(Indtast!L27<>\"\",ROUND((60/$X41*Indtast!L$27),0)*$W$1+$B41,\"x\"))","v":"x"},{"$f":"IF(Indtast!M26<>\"\",ROUND((60/$X41*Indtast!M$26),0)*$W$1+$B41,IF(Indtast!M27<>\"\",ROUND((60/$X41*Indtast!M$27),0)*$W$1+$B41,\"x\"))","v":"x"},{"$f":"IF(Indtast!N26<>\"\",ROUND((60/$X41*Indtast!N$26),0)*$W$1+$B41,IF(Indtast!N27<>\"\",ROUND((60/$X41*Indtast!N$27),0)*$W$1+$B41,\"x\"))","v":"x"},{"$f":"IF(Indtast!O26<>\"\",ROUND((60/$X41*Indtast!O$26),0)*$W$1+$B41,IF(Indtast!O27<>\"\",ROUND((60/$X41*Indtast!O$27),0)*$W$1+$B41,\"x\"))","v":"x"},{"$f":"IF(Indtast!P26<>\"\",ROUND((60/$X41*Indtast!P$26),0)*$W$1+$B41,IF(Indtast!P27<>\"\",ROUND((60/$X41*Indtast!P$27),0)*$W$1+$B41,\"x\"))","v":"x"},{"$f":"IF(Indtast!Q26<>\"\",ROUND((60/$X41*Indtast!Q$26),0)*$W$1+$B41,IF(Indtast!Q27<>\"\",ROUND((60/$X41*Indtast!Q$27),0)*$W$1+$B41,\"x\"))","v":"x"},{"$f":"IF(Indtast!R26<>\"\",ROUND((60/$X41*Indtast!R$26),0)*$W$1+$B41,IF(Indtast!R27<>\"\",ROUND((60/$X41*Indtast!R$27),0)*$W$1+$B41,\"x\"))","v":"x"},{"$f":"IF(Indtast!S26<>\"\",ROUND((60/$X41*Indtast!S$26),0)*$W$1+$B41,IF(Indtast!S27<>\"\",ROUND((60/$X41*Indtast!S$27),0)*$W$1+$B41,\"x\"))","v":"x"},{"$f":"IF(Indtast!T26<>\"\",ROUND((60/$X41*Indtast!T$26),0)*$W$1+$B41,IF(Indtast!T27<>\"\",ROUND((60/$X41*Indtast!T$27),0)*$W$1+$B41,\"x\"))","v":"x"},{"$f":"IF(Indtast!U26<>\"\",ROUND((60/$X41*Indtast!U$26),0)*$W$1+$B41,IF(Indtast!U27<>\"\",ROUND((60/$X41*Indtast!U$27),0)*$W$1+$B41,\"x\"))","v":"x"},{"$f":"IF(Indtast!V26<>\"\",ROUND((60/$X41*Indtast!V$26),0)*$W$1+$B41,IF(Indtast!V27<>\"\",ROUND((60/$X41*Indtast!V$27),0)*$W$1+$B41,\"x\"))","v":"x"},{"$f":"IF(Indtast!W26<>\"\",ROUND((60/$X41*Indtast!W$26),0)*$W$1+$B41,IF(Indtast!W27<>\"\",ROUND((60/$X41*Indtast!W$27),0)*$W$1+$B41,\"x\"))","v":"x"},{"$f":"IF(Indtast!X26<>\"\",ROUND((60/$X41*Indtast!X$26),0)*$W$1+$B41,IF(Indtast!X27<>\"\",ROUND((60/$X41*Indtast!X$27),0)*$W$1+$B41,\"x\"))","v":"x"},{"$f":"IF(Indtast!Y26<>\"\",ROUND((60/$X41*Indtast!Y$26),0)*$W$1+$B41,IF(Indtast!Y27<>\"\",ROUND((60/$X41*Indtast!Y$27),0)*$W$1+$B41,\"x\"))","v":"x"},{"$f":"IF(Indtast!Z26<>\"\",ROUND((60/$X41*Indtast!Z$26),0)*$W$1+$B41,IF(Indtast!Z27<>\"\",ROUND((60/$X41*Indtast!Z$27),0)*$W$1+$B41,\"x\"))","v":"x"},{"$f":"IF(Indtast!AA26<>\"\",ROUND((60/$X41*Indtast!AA$26),0)*$W$1+$B41,IF(Indtast!AA27<>\"\",ROUND((60/$X41*Indtast!AA$27),0)*$W$1+$B41,\"x\"))","v":"x"},{"$f":"IF(Indtast!AB26<>\"\",ROUND((60/$X41*Indtast!AB$26),0)*$W$1+$B41,IF(Indtast!AB27<>\"\",ROUND((60/$X41*Indtast!AB$27),0)*$W$1+$B41,\"x\"))","v":"x"},null,{"$f":"Indtast!$E$26","v":0}]
[{"$f":"Indtast!A26&\" \"&Indtast!$D$2","v":"B Mel"},{"$f":"IF(Indtast!$B$26<>\"\",Indtast!$B$26,\"\")","v":""},{"$f":"IF(Indtast!I26<>\"\",ROUND((60/$X42*Indtast!I$26),0)*$W$1+$B42,IF(Indtast!I27<>\"\",ROUND((60/$X42*Indtast!I$27),0)*$W$1+$B42,\"x\"))","v":"x"},{"$f":"IF(Indtast!J26<>\"\",ROUND((60/$X42*Indtast!J$26),0)*$W$1+$B42,IF(Indtast!J27<>\"\",ROUND((60/$X42*Indtast!J$27),0)*$W$1+$B42,\"x\"))","v":"x"},{"$f":"IF(Indtast!K26<>\"\",ROUND((60/$X42*Indtast!K$26),0)*$W$1+$B42,IF(Indtast!K27<>\"\",ROUND((60/$X42*Indtast!K$27),0)*$W$1+$B42,\"x\"))","v":"x"},{"$f":"IF(Indtast!L26<>\"\",ROUND((60/$X42*Indtast!L$26),0)*$W$1+$B42,IF(Indtast!L27<>\"\",ROUND((60/$X42*Indtast!L$27),0)*$W$1+$B42,\"x\"))","v":"x"},{"$f":"IF(Indtast!M26<>\"\",ROUND((60/$X42*Indtast!M$26),0)*$W$1+$B42,IF(Indtast!M27<>\"\",ROUND((60/$X42*Indtast!M$27),0)*$W$1+$B42,\"x\"))","v":"x"},{"$f":"IF(Indtast!N26<>\"\",ROUND((60/$X42*Indtast!N$26),0)*$W$1+$B42,IF(Indtast!N27<>\"\",ROUND((60/$X42*Indtast!N$27),0)*$W$1+$B42,\"x\"))","v":"x"},{"$f":"IF(Indtast!O26<>\"\",ROUND((60/$X42*Indtast!O$26),0)*$W$1+$B42,IF(Indtast!O27<>\"\",ROUND((60/$X42*Indtast!O$27),0)*$W$1+$B42,\"x\"))","v":"x"},{"$f":"IF(Indtast!P26<>\"\",ROUND((60/$X42*Indtast!P$26),0)*$W$1+$B42,IF(Indtast!P27<>\"\",ROUND((60/$X42*Indtast!P$27),0)*$W$1+$B42,\"x\"))","v":"x"},{"$f":"IF(Indtast!Q26<>\"\",ROUND((60/$X42*Indtast!Q$26),0)*$W$1+$B42,IF(Indtast!Q27<>\"\",ROUND((60/$X42*Indtast!Q$27),0)*$W$1+$B42,\"x\"))","v":"x"},{"$f":"IF(Indtast!R26<>\"\",ROUND((60/$X42*Indtast!R$26),0)*$W$1+$B42,IF(Indtast!R27<>\"\",ROUND((60/$X42*Indtast!R$27),0)*$W$1+$B42,\"x\"))","v":"x"},{"$f":"IF(Indtast!S26<>\"\",ROUND((60/$X42*Indtast!S$26),0)*$W$1+$B42,IF(Indtast!S27<>\"\",ROUND((60/$X42*Indtast!S$27),0)*$W$1+$B42,\"x\"))","v":"x"},{"$f":"IF(Indtast!T26<>\"\",ROUND((60/$X42*Indtast!T$26),0)*$W$1+$B42,IF(Indtast!T27<>\"\",ROUND((60/$X42*Indtast!T$27),0)*$W$1+$B42,\"x\"))","v":"x"},{"$f":"IF(Indtast!U26<>\"\",ROUND((60/$X42*Indtast!U$26),0)*$W$1+$B42,IF(Indtast!U27<>\"\",ROUND((60/$X42*Indtast!U$27),0)*$W$1+$B42,\"x\"))","v":"x"},{"$f":"IF(Indtast!V26<>\"\",ROUND((60/$X42*Indtast!V$26),0)*$W$1+$B42,IF(Indtast!V27<>\"\",ROUND((60/$X42*Indtast!V$27),0)*$W$1+$B42,\"x\"))","v":"x"},{"$f":"IF(Indtast!W26<>\"\",ROUND((60/$X42*Indtast!W$26),0)*$W$1+$B42,IF(Indtast!W27<>\"\",ROUND((60/$X42*Indtast!W$27),0)*$W$1+$B42,\"x\"))","v":"x"},{"$f":"IF(Indtast!X26<>\"\",ROUND((60/$X42*Indtast!X$26),0)*$W$1+$B42,IF(Indtast!X27<>\"\",ROUND((60/$X42*Indtast!X$27),0)*$W$1+$B42,\"x\"))","v":"x"},{"$f":"IF(Indtast!Y26<>\"\",ROUND((60/$X42*Indtast!Y$26),0)*$W$1+$B42,IF(Indtast!Y27<>\"\",ROUND((60/$X42*Indtast!Y$27),0)*$W$1+$B42,\"x\"))","v":"x"},{"$f":"IF(Indtast!Z26<>\"\",ROUND((60/$X42*Indtast!Z$26),0)*$W$1+$B42,IF(Indtast!Z27<>\"\",ROUND((60/$X42*Indtast!Z$27),0)*$W$1+$B42,\"x\"))","v":"x"},{"$f":"IF(Indtast!AA26<>\"\",ROUND((60/$X42*Indtast!AA$26),0)*$W$1+$B42,IF(Indtast!AA27<>\"\",ROUND((60/$X42*Indtast!AA$27),0)*$W$1+$B42,\"x\"))","v":"x"},{"$f":"IF(Indtast!AB26<>\"\",ROUND((60/$X42*Indtast!AB$26),0)*$W$1+$B42,IF(Indtast!AB27<>\"\",ROUND((60/$X42*Indtast!AB$27),0)*$W$1+$B42,\"x\"))","v":"x"},null,{"$f":"Indtast!$D$26","v":0}]
[{"$f":"Indtast!A26&\" \"&Indtast!$C$2","v":"B Høj"},{"$f":"IF(Indtast!$B$26<>\"\",Indtast!$B$26,\"\")","v":""},{"$f":"IF(Indtast!I26<>\"\",ROUND((60/$X43*Indtast!I$26),0)*$W$1+$B43,IF(Indtast!I27<>\"\",ROUND((60/$X43*Indtast!I$27),0)*$W$1+$B43,\"x\"))","v":"x"},{"$f":"IF(Indtast!J26<>\"\",ROUND((60/$X43*Indtast!J$26),0)*$W$1+$B43,IF(Indtast!J27<>\"\",ROUND((60/$X43*Indtast!J$27),0)*$W$1+$B43,\"x\"))","v":"x"},{"$f":"IF(Indtast!K26<>\"\",ROUND((60/$X43*Indtast!K$26),0)*$W$1+$B43,IF(Indtast!K27<>\"\",ROUND((60/$X43*Indtast!K$27),0)*$W$1+$B43,\"x\"))","v":"x"},{"$f":"IF(Indtast!L26<>\"\",ROUND((60/$X43*Indtast!L$26),0)*$W$1+$B43,IF(Indtast!L27<>\"\",ROUND((60/$X43*Indtast!L$27),0)*$W$1+$B43,\"x\"))","v":"x"},{"$f":"IF(Indtast!M26<>\"\",ROUND((60/$X43*Indtast!M$26),0)*$W$1+$B43,IF(Indtast!M27<>\"\",ROUND((60/$X43*Indtast!M$27),0)*$W$1+$B43,\"x\"))","v":"x"},{"$f":"IF(Indtast!N26<>\"\",ROUND((60/$X43*Indtast!N$26),0)*$W$1+$B43,IF(Indtast!N27<>\"\",ROUND((60/$X43*Indtast!N$27),0)*$W$1+$B43,\"x\"))","v":"x"},{"$f":"IF(Indtast!O26<>\"\",ROUND((60/$X43*Indtast!O$26),0)*$W$1+$B43,IF(Indtast!O27<>\"\",ROUND((60/$X43*Indtast!O$27),0)*$W$1+$B43,\"x\"))","v":"x"},{"$f":"IF(Indtast!P26<>\"\",ROUND((60/$X43*Indtast!P$26),0)*$W$1+$B43,IF(Indtast!P27<>\"\",ROUND((60/$X43*Indtast!P$27),0)*$W$1+$B43,\"x\"))","v":"x"},{"$f":"IF(Indtast!Q26<>\"\",ROUND((60/$X43*Indtast!Q$26),0)*$W$1+$B43,IF(Indtast!Q27<>\"\",ROUND((60/$X43*Indtast!Q$27),0)*$W$1+$B43,\"x\"))","v":"x"},{"$f":"IF(Indtast!R26<>\"\",ROUND((60/$X43*Indtast!R$26),0)*$W$1+$B43,IF(Indtast!R27<>\"\",ROUND((60/$X43*Indtast!R$27),0)*$W$1+$B43,\"x\"))","v":"x"},{"$f":"IF(Indtast!S26<>\"\",ROUND((60/$X43*Indtast!S$26),0)*$W$1+$B43,IF(Indtast!S27<>\"\",ROUND((60/$X43*Indtast!S$27),0)*$W$1+$B43,\"x\"))","v":"x"},{"$f":"IF(Indtast!T26<>\"\",ROUND((60/$X43*Indtast!T$26),0)*$W$1+$B43,IF(Indtast!T27<>\"\",ROUND((60/$X43*Indtast!T$27),0)*$W$1+$B43,\"x\"))","v":"x"},{"$f":"IF(Indtast!U26<>\"\",ROUND((60/$X43*Indtast!U$26),0)*$W$1+$B43,IF(Indtast!U27<>\"\",ROUND((60/$X43*Indtast!U$27),0)*$W$1+$B43,\"x\"))","v":"x"},{"$f":"IF(Indtast!V26<>\"\",ROUND((60/$X43*Indtast!V$26),0)*$W$1+$B43,IF(Indtast!V27<>\"\",ROUND((60/$X43*Indtast!V$27),0)*$W$1+$B43,\"x\"))","v":"x"},{"$f":"IF(Indtast!W26<>\"\",ROUND((60/$X43*Indtast!W$26),0)*$W$1+$B43,IF(Indtast!W27<>\"\",ROUND((60/$X43*Indtast!W$27),0)*$W$1+$B43,\"x\"))","v":"x"},{"$f":"IF(Indtast!X26<>\"\",ROUND((60/$X43*Indtast!X$26),0)*$W$1+$B43,IF(Indtast!X27<>\"\",ROUND((60/$X43*Indtast!X$27),0)*$W$1+$B43,\"x\"))","v":"x"},{"$f":"IF(Indtast!Y26<>\"\",ROUND((60/$X43*Indtast!Y$26),0)*$W$1+$B43,IF(Indtast!Y27<>\"\",ROUND((60/$X43*Indtast!Y$27),0)*$W$1+$B43,\"x\"))","v":"x"},{"$f":"IF(Indtast!Z26<>\"\",ROUND((60/$X43*Indtast!Z$26),0)*$W$1+$B43,IF(Indtast!Z27<>\"\",ROUND((60/$X43*Indtast!Z$27),0)*$W$1+$B43,\"x\"))","v":"x"},{"$f":"IF(Indtast!AA26<>\"\",ROUND((60/$X43*Indtast!AA$26),0)*$W$1+$B43,IF(Indtast!AA27<>\"\",ROUND((60/$X43*Indtast!AA$27),0)*$W$1+$B43,\"x\"))","v":"x"},{"$f":"IF(Indtast!AB26<>\"\",ROUND((60/$X43*Indtast!AB$26),0)*$W$1+$B43,IF(Indtast!AB27<>\"\",ROUND((60/$X43*Indtast!AB$27),0)*$W$1+$B43,\"x\"))","v":"x"},null,{"$f":"Indtast!$C$26","v":0}]
[{"$f":"Indtast!$A28&\" \"&Indtast!$E$2","v":"C Lav"},{"$f":"IF(Indtast!$B$28<>\"\",Indtast!$B$28,\"\")","v":""},{"$f":"IF(Indtast!I28<>\"\",ROUND((60/$X44*Indtast!I$28),0)*$W$1+$B44,IF(Indtast!I29<>\"\",ROUND((60/$X44*Indtast!I$29),0)*$W$1+$B44,\"x\"))","v":"x"},{"$f":"IF(Indtast!J28<>\"\",ROUND((60/$X44*Indtast!J$28),0)*$W$1+$B44,IF(Indtast!J29<>\"\",ROUND((60/$X44*Indtast!J$29),0)*$W$1+$B44,\"x\"))","v":"x"},{"$f":"IF(Indtast!K28<>\"\",ROUND((60/$X44*Indtast!K$28),0)*$W$1+$B44,IF(Indtast!K29<>\"\",ROUND((60/$X44*Indtast!K$29),0)*$W$1+$B44,\"x\"))","v":"x"},{"$f":"IF(Indtast!L28<>\"\",ROUND((60/$X44*Indtast!L$28),0)*$W$1+$B44,IF(Indtast!L29<>\"\",ROUND((60/$X44*Indtast!L$29),0)*$W$1+$B44,\"x\"))","v":"x"},{"$f":"IF(Indtast!M28<>\"\",ROUND((60/$X44*Indtast!M$28),0)*$W$1+$B44,IF(Indtast!M29<>\"\",ROUND((60/$X44*Indtast!M$29),0)*$W$1+$B44,\"x\"))","v":"x"},{"$f":"IF(Indtast!N28<>\"\",ROUND((60/$X44*Indtast!N$28),0)*$W$1+$B44,IF(Indtast!N29<>\"\",ROUND((60/$X44*Indtast!N$29),0)*$W$1+$B44,\"x\"))","v":"x"},{"$f":"IF(Indtast!O28<>\"\",ROUND((60/$X44*Indtast!O$28),0)*$W$1+$B44,IF(Indtast!O29<>\"\",ROUND((60/$X44*Indtast!O$29),0)*$W$1+$B44,\"x\"))","v":"x"},{"$f":"IF(Indtast!P28<>\"\",ROUND((60/$X44*Indtast!P$28),0)*$W$1+$B44,IF(Indtast!P29<>\"\",ROUND((60/$X44*Indtast!P$29),0)*$W$1+$B44,\"x\"))","v":"x"},{"$f":"IF(Indtast!Q28<>\"\",ROUND((60/$X44*Indtast!Q$28),0)*$W$1+$B44,IF(Indtast!Q29<>\"\",ROUND((60/$X44*Indtast!Q$29),0)*$W$1+$B44,\"x\"))","v":"x"},{"$f":"IF(Indtast!R28<>\"\",ROUND((60/$X44*Indtast!R$28),0)*$W$1+$B44,IF(Indtast!R29<>\"\",ROUND((60/$X44*Indtast!R$29),0)*$W$1+$B44,\"x\"))","v":"x"},{"$f":"IF(Indtast!S28<>\"\",ROUND((60/$X44*Indtast!S$28),0)*$W$1+$B44,IF(Indtast!S29<>\"\",ROUND((60/$X44*Indtast!S$29),0)*$W$1+$B44,\"x\"))","v":"x"},{"$f":"IF(Indtast!T28<>\"\",ROUND((60/$X44*Indtast!T$28),0)*$W$1+$B44,IF(Indtast!T29<>\"\",ROUND((60/$X44*Indtast!T$29),0)*$W$1+$B44,\"x\"))","v":"x"},{"$f":"IF(Indtast!U28<>\"\",ROUND((60/$X44*Indtast!U$28),0)*$W$1+$B44,IF(Indtast!U29<>\"\",ROUND((60/$X44*Indtast!U$29),0)*$W$1+$B44,\"x\"))","v":"x"},{"$f":"IF(Indtast!V28<>\"\",ROUND((60/$X44*Indtast!V$28),0)*$W$1+$B44,IF(Indtast!V29<>\"\",ROUND((60/$X44*Indtast!V$29),0)*$W$1+$B44,\"x\"))","v":"x"},{"$f":"IF(Indtast!W28<>\"\",ROUND((60/$X44*Indtast!W$28),0)*$W$1+$B44,IF(Indtast!W29<>\"\",ROUND((60/$X44*Indtast!W$29),0)*$W$1+$B44,\"x\"))","v":"x"},{"$f":"IF(Indtast!X28<>\"\",ROUND((60/$X44*Indtast!X$28),0)*$W$1+$B44,IF(Indtast!X29<>\"\",ROUND((60/$X44*Indtast!X$29),0)*$W$1+$B44,\"x\"))","v":"x"},{"$f":"IF(Indtast!Y28<>\"\",ROUND((60/$X44*Indtast!Y$28),0)*$W$1+$B44,IF(Indtast!Y29<>\"\",ROUND((60/$X44*Indtast!Y$29),0)*$W$1+$B44,\"x\"))","v":"x"},{"$f":"IF(Indtast!Z28<>\"\",ROUND((60/$X44*Indtast!Z$28),0)*$W$1+$B44,IF(Indtast!Z29<>\"\",ROUND((60/$X44*Indtast!Z$29),0)*$W$1+$B44,\"x\"))","v":"x"},{"$f":"IF(Indtast!AA28<>\"\",ROUND((60/$X44*Indtast!AA$28),0)*$W$1+$B44,IF(Indtast!AA29<>\"\",ROUND((60/$X44*Indtast!AA$29),0)*$W$1+$B44,\"x\"))","v":"x"},{"$f":"IF(Indtast!AB28<>\"\",ROUND((60/$X44*Indtast!AB$28),0)*$W$1+$B44,IF(Indtast!AB29<>\"\",ROUND((60/$X44*Indtast!AB$29),0)*$W$1+$B44,\"x\"))","v":"x"},null,{"$f":"Indtast!$E$28","v":0}]
[{"$f":"Indtast!A28&\" \"&Indtast!$D$2","v":"C Mel"},{"$f":"IF(Indtast!$B$28<>\"\",Indtast!$B$28,\"\")","v":""},{"$f":"IF(Indtast!I28<>\"\",ROUND((60/$X45*Indtast!I$28),0)*$W$1+$B45,IF(Indtast!I29<>\"\",ROUND((60/$X45*Indtast!I$29),0)*$W$1+$B45,\"x\"))","v":"x"},{"$f":"IF(Indtast!J28<>\"\",ROUND((60/$X45*Indtast!J$28),0)*$W$1+$B45,IF(Indtast!J29<>\"\",ROUND((60/$X45*Indtast!J$29),0)*$W$1+$B45,\"x\"))","v":"x"},{"$f":"IF(Indtast!K28<>\"\",ROUND((60/$X45*Indtast!K$28),0)*$W$1+$B45,IF(Indtast!K29<>\"\",ROUND((60/$X45*Indtast!K$29),0)*$W$1+$B45,\"x\"))","v":"x"},{"$f":"IF(Indtast!L28<>\"\",ROUND((60/$X45*Indtast!L$28),0)*$W$1+$B45,IF(Indtast!L29<>\"\",ROUND((60/$X45*Indtast!L$29),0)*$W$1+$B45,\"x\"))","v":"x"},{"$f":"IF(Indtast!M28<>\"\",ROUND((60/$X45*Indtast!M$28),0)*$W$1+$B45,IF(Indtast!M29<>\"\",ROUND((60/$X45*Indtast!M$29),0)*$W$1+$B45,\"x\"))","v":"x"},{"$f":"IF(Indtast!N28<>\"\",ROUND((60/$X45*Indtast!N$28),0)*$W$1+$B45,IF(Indtast!N29<>\"\",ROUND((60/$X45*Indtast!N$29),0)*$W$1+$B45,\"x\"))","v":"x"},{"$f":"IF(Indtast!O28<>\"\",ROUND((60/$X45*Indtast!O$28),0)*$W$1+$B45,IF(Indtast!O29<>\"\",ROUND((60/$X45*Indtast!O$29),0)*$W$1+$B45,\"x\"))","v":"x"},{"$f":"IF(Indtast!P28<>\"\",ROUND((60/$X45*Indtast!P$28),0)*$W$1+$B45,IF(Indtast!P29<>\"\",ROUND((60/$X45*Indtast!P$29),0)*$W$1+$B45,\"x\"))","v":"x"},{"$f":"IF(Indtast!Q28<>\"\",ROUND((60/$X45*Indtast!Q$28),0)*$W$1+$B45,IF(Indtast!Q29<>\"\",ROUND((60/$X45*Indtast!Q$29),0)*$W$1+$B45,\"x\"))","v":"x"},{"$f":"IF(Indtast!R28<>\"\",ROUND((60/$X45*Indtast!R$28),0)*$W$1+$B45,IF(Indtast!R29<>\"\",ROUND((60/$X45*Indtast!R$29),0)*$W$1+$B45,\"x\"))","v":"x"},{"$f":"IF(Indtast!S28<>\"\",ROUND((60/$X45*Indtast!S$28),0)*$W$1+$B45,IF(Indtast!S29<>\"\",ROUND((60/$X45*Indtast!S$29),0)*$W$1+$B45,\"x\"))","v":"x"},{"$f":"IF(Indtast!T28<>\"\",ROUND((60/$X45*Indtast!T$28),0)*$W$1+$B45,IF(Indtast!T29<>\"\",ROUND((60/$X45*Indtast!T$29),0)*$W$1+$B45,\"x\"))","v":"x"},{"$f":"IF(Indtast!U28<>\"\",ROUND((60/$X45*Indtast!U$28),0)*$W$1+$B45,IF(Indtast!U29<>\"\",ROUND((60/$X45*Indtast!U$29),0)*$W$1+$B45,\"x\"))","v":"x"},{"$f":"IF(Indtast!V28<>\"\",ROUND((60/$X45*Indtast!V$28),0)*$W$1+$B45,IF(Indtast!V29<>\"\",ROUND((60/$X45*Indtast!V$29),0)*$W$1+$B45,\"x\"))","v":"x"},{"$f":"IF(Indtast!W28<>\"\",ROUND((60/$X45*Indtast!W$28),0)*$W$1+$B45,IF(Indtast!W29<>\"\",ROUND((60/$X45*Indtast!W$29),0)*$W$1+$B45,\"x\"))","v":"x"},{"$f":"IF(Indtast!X28<>\"\",ROUND((60/$X45*Indtast!X$28),0)*$W$1+$B45,IF(Indtast!X29<>\"\",ROUND((60/$X45*Indtast!X$29),0)*$W$1+$B45,\"x\"))","v":"x"},{"$f":"IF(Indtast!Y28<>\"\",ROUND((60/$X45*Indtast!Y$28),0)*$W$1+$B45,IF(Indtast!Y29<>\"\",ROUND((60/$X45*Indtast!Y$29),0)*$W$1+$B45,\"x\"))","v":"x"},{"$f":"IF(Indtast!Z28<>\"\",ROUND((60/$X45*Indtast!Z$28),0)*$W$1+$B45,IF(Indtast!Z29<>\"\",ROUND((60/$X45*Indtast!Z$29),0)*$W$1+$B45,\"x\"))","v":"x"},{"$f":"IF(Indtast!AA28<>\"\",ROUND((60/$X45*Indtast!AA$28),0)*$W$1+$B45,IF(Indtast!AA29<>\"\",ROUND((60/$X45*Indtast!AA$29),0)*$W$1+$B45,\"x\"))","v":"x"},{"$f":"IF(Indtast!AB28<>\"\",ROUND((60/$X45*Indtast!AB$28),0)*$W$1+$B45,IF(Indtast!AB29<>\"\",ROUND((60/$X45*Indtast!AB$29),0)*$W$1+$B45,\"x\"))","v":"x"},null,{"$f":"Indtast!$D$28","v":0}]
[{"$f":"Indtast!A28&\" \"&Indtast!$C$2","v":"C Høj"},{"$f":"IF(Indtast!$B$28<>\"\",Indtast!$B$28,\"\")","v":""},{"$f":"IF(Indtast!I28<>\"\",ROUND((60/$X46*Indtast!I$28),0)*$W$1+$B46,IF(Indtast!I29<>\"\",ROUND((60/$X46*Indtast!I$29),0)*$W$1+$B46,\"x\"))","v":"x"},{"$f":"IF(Indtast!J28<>\"\",ROUND((60/$X46*Indtast!J$28),0)*$W$1+$B46,IF(Indtast!J29<>\"\",ROUND((60/$X46*Indtast!J$29),0)*$W$1+$B46,\"x\"))","v":"x"},{"$f":"IF(Indtast!K28<>\"\",ROUND((60/$X46*Indtast!K$28),0)*$W$1+$B46,IF(Indtast!K29<>\"\",ROUND((60/$X46*Indtast!K$29),0)*$W$1+$B46,\"x\"))","v":"x"},{"$f":"IF(Indtast!L28<>\"\",ROUND((60/$X46*Indtast!L$28),0)*$W$1+$B46,IF(Indtast!L29<>\"\",ROUND((60/$X46*Indtast!L$29),0)*$W$1+$B46,\"x\"))","v":"x"},{"$f":"IF(Indtast!M28<>\"\",ROUND((60/$X46*Indtast!M$28),0)*$W$1+$B46,IF(Indtast!M29<>\"\",ROUND((60/$X46*Indtast!M$29),0)*$W$1+$B46,\"x\"))","v":"x"},{"$f":"IF(Indtast!N28<>\"\",ROUND((60/$X46*Indtast!N$28),0)*$W$1+$B46,IF(Indtast!N29<>\"\",ROUND((60/$X46*Indtast!N$29),0)*$W$1+$B46,\"x\"))","v":"x"},{"$f":"IF(Indtast!O28<>\"\",ROUND((60/$X46*Indtast!O$28),0)*$W$1+$B46,IF(Indtast!O29<>\"\",ROUND((60/$X46*Indtast!O$29),0)*$W$1+$B46,\"x\"))","v":"x"},{"$f":"IF(Indtast!P28<>\"\",ROUND((60/$X46*Indtast!P$28),0)*$W$1+$B46,IF(Indtast!P29<>\"\",ROUND((60/$X46*Indtast!P$29),0)*$W$1+$B46,\"x\"))","v":"x"},{"$f":"IF(Indtast!Q28<>\"\",ROUND((60/$X46*Indtast!Q$28),0)*$W$1+$B46,IF(Indtast!Q29<>\"\",ROUND((60/$X46*Indtast!Q$29),0)*$W$1+$B46,\"x\"))","v":"x"},{"$f":"IF(Indtast!R28<>\"\",ROUND((60/$X46*Indtast!R$28),0)*$W$1+$B46,IF(Indtast!R29<>\"\",ROUND((60/$X46*Indtast!R$29),0)*$W$1+$B46,\"x\"))","v":"x"},{"$f":"IF(Indtast!S28<>\"\",ROUND((60/$X46*Indtast!S$28),0)*$W$1+$B46,IF(Indtast!S29<>\"\",ROUND((60/$X46*Indtast!S$29),0)*$W$1+$B46,\"x\"))","v":"x"},{"$f":"IF(Indtast!T28<>\"\",ROUND((60/$X46*Indtast!T$28),0)*$W$1+$B46,IF(Indtast!T29<>\"\",ROUND((60/$X46*Indtast!T$29),0)*$W$1+$B46,\"x\"))","v":"x"},{"$f":"IF(Indtast!U28<>\"\",ROUND((60/$X46*Indtast!U$28),0)*$W$1+$B46,IF(Indtast!U29<>\"\",ROUND((60/$X46*Indtast!U$29),0)*$W$1+$B46,\"x\"))","v":"x"},{"$f":"IF(Indtast!V28<>\"\",ROUND((60/$X46*Indtast!V$28),0)*$W$1+$B46,IF(Indtast!V29<>\"\",ROUND((60/$X46*Indtast!V$29),0)*$W$1+$B46,\"x\"))","v":"x"},{"$f":"IF(Indtast!W28<>\"\",ROUND((60/$X46*Indtast!W$28),0)*$W$1+$B46,IF(Indtast!W29<>\"\",ROUND((60/$X46*Indtast!W$29),0)*$W$1+$B46,\"x\"))","v":"x"},{"$f":"IF(Indtast!X28<>\"\",ROUND((60/$X46*Indtast!X$28),0)*$W$1+$B46,IF(Indtast!X29<>\"\",ROUND((60/$X46*Indtast!X$29),0)*$W$1+$B46,\"x\"))","v":"x"},{"$f":"IF(Indtast!Y28<>\"\",ROUND((60/$X46*Indtast!Y$28),0)*$W$1+$B46,IF(Indtast!Y29<>\"\",ROUND((60/$X46*Indtast!Y$29),0)*$W$1+$B46,\"x\"))","v":"x"},{"$f":"IF(Indtast!Z28<>\"\",ROUND((60/$X46*Indtast!Z$28),0)*$W$1+$B46,IF(Indtast!Z29<>\"\",ROUND((60/$X46*Indtast!Z$29),0)*$W$1+$B46,\"x\"))","v":"x"},{"$f":"IF(Indtast!AA28<>\"\",ROUND((60/$X46*Indtast!AA$28),0)*$W$1+$B46,IF(Indtast!AA29<>\"\",ROUND((60/$X46*Indtast!AA$29),0)*$W$1+$B46,\"x\"))","v":"x"},{"$f":"IF(Indtast!AB28<>\"\",ROUND((60/$X46*Indtast!AB$28),0)*$W$1+$B46,IF(Indtast!AB29<>\"\",ROUND((60/$X46*Indtast!AB$29),0)*$W$1+$B46,\"x\"))","v":"x"},null,{"$f":"Indtast!$C$28","v":0}]
[{"$f":"Indtast!$A32&\" \"&Indtast!$E$2","v":" Lav"},{"$f":"IF(Indtast!$B$32<>\"\",Indtast!$B$32,\"\")","v":""},{"$f":"IF(Indtast!I32<>\"\",ROUND((60/$X47*Indtast!I$32),0)*$W$1+$B47,IF(Indtast!I33<>\"\",ROUND((60/$X47*Indtast!I$33),0)*$W$1+$B47,\"x\"))","v":"x"},{"$f":"IF(Indtast!J32<>\"\",ROUND((60/$X47*Indtast!J$32),0)*$W$1+$B47,IF(Indtast!J33<>\"\",ROUND((60/$X47*Indtast!J$33),0)*$W$1+$B47,\"x\"))","v":"x"},{"$f":"IF(Indtast!K32<>\"\",ROUND((60/$X47*Indtast!K$32),0)*$W$1+$B47,IF(Indtast!K33<>\"\",ROUND((60/$X47*Indtast!K$33),0)*$W$1+$B47,\"x\"))","v":"x"},{"$f":"IF(Indtast!L32<>\"\",ROUND((60/$X47*Indtast!L$32),0)*$W$1+$B47,IF(Indtast!L33<>\"\",ROUND((60/$X47*Indtast!L$33),0)*$W$1+$B47,\"x\"))","v":"x"},{"$f":"IF(Indtast!M32<>\"\",ROUND((60/$X47*Indtast!M$32),0)*$W$1+$B47,IF(Indtast!M33<>\"\",ROUND((60/$X47*Indtast!M$33),0)*$W$1+$B47,\"x\"))","v":"x"},{"$f":"IF(Indtast!N32<>\"\",ROUND((60/$X47*Indtast!N$32),0)*$W$1+$B47,IF(Indtast!N33<>\"\",ROUND((60/$X47*Indtast!N$33),0)*$W$1+$B47,\"x\"))","v":"x"},{"$f":"IF(Indtast!O32<>\"\",ROUND((60/$X47*Indtast!O$32),0)*$W$1+$B47,IF(Indtast!O33<>\"\",ROUND((60/$X47*Indtast!O$33),0)*$W$1+$B47,\"x\"))","v":"x"},{"$f":"IF(Indtast!P32<>\"\",ROUND((60/$X47*Indtast!P$32),0)*$W$1+$B47,IF(Indtast!P33<>\"\",ROUND((60/$X47*Indtast!P$33),0)*$W$1+$B47,\"x\"))","v":"x"},{"$f":"IF(Indtast!Q32<>\"\",ROUND((60/$X47*Indtast!Q$32),0)*$W$1+$B47,IF(Indtast!Q33<>\"\",ROUND((60/$X47*Indtast!Q$33),0)*$W$1+$B47,\"x\"))","v":"x"},{"$f":"IF(Indtast!R32<>\"\",ROUND((60/$X47*Indtast!R$32),0)*$W$1+$B47,IF(Indtast!R33<>\"\",ROUND((60/$X47*Indtast!R$33),0)*$W$1+$B47,\"x\"))","v":"x"},{"$f":"IF(Indtast!S32<>\"\",ROUND((60/$X47*Indtast!S$32),0)*$W$1+$B47,IF(Indtast!S33<>\"\",ROUND((60/$X47*Indtast!S$33),0)*$W$1+$B47,\"x\"))","v":"x"},{"$f":"IF(Indtast!T32<>\"\",ROUND((60/$X47*Indtast!T$32),0)*$W$1+$B47,IF(Indtast!T33<>\"\",ROUND((60/$X47*Indtast!T$33),0)*$W$1+$B47,\"x\"))","v":"x"},{"$f":"IF(Indtast!U32<>\"\",ROUND((60/$X47*Indtast!U$32),0)*$W$1+$B47,IF(Indtast!U33<>\"\",ROUND((60/$X47*Indtast!U$33),0)*$W$1+$B47,\"x\"))","v":"x"},{"$f":"IF(Indtast!V32<>\"\",ROUND((60/$X47*Indtast!V$32),0)*$W$1+$B47,IF(Indtast!V33<>\"\",ROUND((60/$X47*Indtast!V$33),0)*$W$1+$B47,\"x\"))","v":"x"},{"$f":"IF(Indtast!W32<>\"\",ROUND((60/$X47*Indtast!W$32),0)*$W$1+$B47,IF(Indtast!W33<>\"\",ROUND((60/$X47*Indtast!W$33),0)*$W$1+$B47,\"x\"))","v":"x"},{"$f":"IF(Indtast!X32<>\"\",ROUND((60/$X47*Indtast!X$32),0)*$W$1+$B47,IF(Indtast!X33<>\"\",ROUND((60/$X47*Indtast!X$33),0)*$W$1+$B47,\"x\"))","v":"x"},{"$f":"IF(Indtast!Y32<>\"\",ROUND((60/$X47*Indtast!Y$32),0)*$W$1+$B47,IF(Indtast!Y33<>\"\",ROUND((60/$X47*Indtast!Y$33),0)*$W$1+$B47,\"x\"))","v":"x"},{"$f":"IF(Indtast!Z32<>\"\",ROUND((60/$X47*Indtast!Z$32),0)*$W$1+$B47,IF(Indtast!Z33<>\"\",ROUND((60/$X47*Indtast!Z$33),0)*$W$1+$B47,\"x\"))","v":"x"},{"$f":"IF(Indtast!AA32<>\"\",ROUND((60/$X47*Indtast!AA$32),0)*$W$1+$B47,IF(Indtast!AA33<>\"\",ROUND((60/$X47*Indtast!AA$33),0)*$W$1+$B47,\"x\"))","v":"x"},{"$f":"IF(Indtast!AB32<>\"\",ROUND((60/$X47*Indtast!AB$32),0)*$W$1+$B47,IF(Indtast!AB33<>\"\",ROUND((60/$X47*Indtast!AB$33),0)*$W$1+$B47,\"x\"))","v":"x"},null,{"$f":"Indtast!$E$32","v":0}]
[{"$f":"Indtast!A32&\" \"&Indtast!$D$2","v":" Mel"},{"$f":"IF(Indtast!$B$32<>\"\",Indtast!$B$32,\"\")","v":""},{"$f":"IF(Indtast!I32<>\"\",ROUND((60/$X48*Indtast!I$32),0)*$W$1+$B48,IF(Indtast!I33<>\"\",ROUND((60/$X48*Indtast!I$33),0)*$W$1+$B48,\"x\"))","v":"x"},{"$f":"IF(Indtast!J32<>\"\",ROUND((60/$X48*Indtast!J$32),0)*$W$1+$B48,IF(Indtast!J33<>\"\",ROUND((60/$X48*Indtast!J$33),0)*$W$1+$B48,\"x\"))","v":"x"},{"$f":"IF(Indtast!K32<>\"\",ROUND((60/$X48*Indtast!K$32),0)*$W$1+$B48,IF(Indtast!K33<>\"\",ROUND((60/$X48*Indtast!K$33),0)*$W$1+$B48,\"x\"))","v":"x"},{"$f":"IF(Indtast!L32<>\"\",ROUND((60/$X48*Indtast!L$32),0)*$W$1+$B48,IF(Indtast!L33<>\"\",ROUND((60/$X48*Indtast!L$33),0)*$W$1+$B48,\"x\"))","v":"x"},{"$f":"IF(Indtast!M32<>\"\",ROUND((60/$X48*Indtast!M$32),0)*$W$1+$B48,IF(Indtast!M33<>\"\",ROUND((60/$X48*Indtast!M$33),0)*$W$1+$B48,\"x\"))","v":"x"},{"$f":"IF(Indtast!N32<>\"\",ROUND((60/$X48*Indtast!N$32),0)*$W$1+$B48,IF(Indtast!N33<>\"\",ROUND((60/$X48*Indtast!N$33),0)*$W$1+$B48,\"x\"))","v":"x"},{"$f":"IF(Indtast!O32<>\"\",ROUND((60/$X48*Indtast!O$32),0)*$W$1+$B48,IF(Indtast!O33<>\"\",ROUND((60/$X48*Indtast!O$33),0)*$W$1+$B48,\"x\"))","v":"x"},{"$f":"IF(Indtast!P32<>\"\",ROUND((60/$X48*Indtast!P$32),0)*$W$1+$B48,IF(Indtast!P33<>\"\",ROUND((60/$X48*Indtast!P$33),0)*$W$1+$B48,\"x\"))","v":"x"},{"$f":"IF(Indtast!Q32<>\"\",ROUND((60/$X48*Indtast!Q$32),0)*$W$1+$B48,IF(Indtast!Q33<>\"\",ROUND((60/$X48*Indtast!Q$33),0)*$W$1+$B48,\"x\"))","v":"x"},{"$f":"IF(Indtast!R32<>\"\",ROUND((60/$X48*Indtast!R$32),0)*$W$1+$B48,IF(Indtast!R33<>\"\",ROUND((60/$X48*Indtast!R$33),0)*$W$1+$B48,\"x\"))","v":"x"},{"$f":"IF(Indtast!S32<>\"\",ROUND((60/$X48*Indtast!S$32),0)*$W$1+$B48,IF(Indtast!S33<>\"\",ROUND((60/$X48*Indtast!S$33),0)*$W$1+$B48,\"x\"))","v":"x"},{"$f":"IF(Indtast!T32<>\"\",ROUND((60/$X48*Indtast!T$32),0)*$W$1+$B48,IF(Indtast!T33<>\"\",ROUND((60/$X48*Indtast!T$33),0)*$W$1+$B48,\"x\"))","v":"x"},{"$f":"IF(Indtast!U32<>\"\",ROUND((60/$X48*Indtast!U$32),0)*$W$1+$B48,IF(Indtast!U33<>\"\",ROUND((60/$X48*Indtast!U$33),0)*$W$1+$B48,\"x\"))","v":"x"},{"$f":"IF(Indtast!V32<>\"\",ROUND((60/$X48*Indtast!V$32),0)*$W$1+$B48,IF(Indtast!V33<>\"\",ROUND((60/$X48*Indtast!V$33),0)*$W$1+$B48,\"x\"))","v":"x"},{"$f":"IF(Indtast!W32<>\"\",ROUND((60/$X48*Indtast!W$32),0)*$W$1+$B48,IF(Indtast!W33<>\"\",ROUND((60/$X48*Indtast!W$33),0)*$W$1+$B48,\"x\"))","v":"x"},{"$f":"IF(Indtast!X32<>\"\",ROUND((60/$X48*Indtast!X$32),0)*$W$1+$B48,IF(Indtast!X33<>\"\",ROUND((60/$X48*Indtast!X$33),0)*$W$1+$B48,\"x\"))","v":"x"},{"$f":"IF(Indtast!Y32<>\"\",ROUND((60/$X48*Indtast!Y$32),0)*$W$1+$B48,IF(Indtast!Y33<>\"\",ROUND((60/$X48*Indtast!Y$33),0)*$W$1+$B48,\"x\"))","v":"x"},{"$f":"IF(Indtast!Z32<>\"\",ROUND((60/$X48*Indtast!Z$32),0)*$W$1+$B48,IF(Indtast!Z33<>\"\",ROUND((60/$X48*Indtast!Z$33),0)*$W$1+$B48,\"x\"))","v":"x"},{"$f":"IF(Indtast!AA32<>\"\",ROUND((60/$X48*Indtast!AA$32),0)*$W$1+$B48,IF(Indtast!AA33<>\"\",ROUND((60/$X48*Indtast!AA$33),0)*$W$1+$B48,\"x\"))","v":"x"},{"$f":"IF(Indtast!AB32<>\"\",ROUND((60/$X48*Indtast!AB$32),0)*$W$1+$B48,IF(Indtast!AB33<>\"\",ROUND((60/$X48*Indtast!AB$33),0)*$W$1+$B48,\"x\"))","v":"x"},null,{"$f":"Indtast!$D$32","v":0}]
[{"$f":"Indtast!A32&\" \"&Indtast!$C$2","v":" Høj"},{"$f":"IF(Indtast!$B$32<>\"\",Indtast!$B$32,\"\")","v":""},{"$f":"IF(Indtast!I32<>\"\",ROUND((60/$X49*Indtast!I$32),0)*$W$1+$B49,IF(Indtast!I33<>\"\",ROUND((60/$X49*Indtast!I$33),0)*$W$1+$B49,\"x\"))","v":"x"},{"$f":"IF(Indtast!J32<>\"\",ROUND((60/$X49*Indtast!J$32),0)*$W$1+$B49,IF(Indtast!J33<>\"\",ROUND((60/$X49*Indtast!J$33),0)*$W$1+$B49,\"x\"))","v":"x"},{"$f":"IF(Indtast!K32<>\"\",ROUND((60/$X49*Indtast!K$32),0)*$W$1+$B49,IF(Indtast!K33<>\"\",ROUND((60/$X49*Indtast!K$33),0)*$W$1+$B49,\"x\"))","v":"x"},{"$f":"IF(Indtast!L32<>\"\",ROUND((60/$X49*Indtast!L$32),0)*$W$1+$B49,IF(Indtast!L33<>\"\",ROUND((60/$X49*Indtast!L$33),0)*$W$1+$B49,\"x\"))","v":"x"},{"$f":"IF(Indtast!M32<>\"\",ROUND((60/$X49*Indtast!M$32),0)*$W$1+$B49,IF(Indtast!M33<>\"\",ROUND((60/$X49*Indtast!M$33),0)*$W$1+$B49,\"x\"))","v":"x"},{"$f":"IF(Indtast!N32<>\"\",ROUND((60/$X49*Indtast!N$32),0)*$W$1+$B49,IF(Indtast!N33<>\"\",ROUND((60/$X49*Indtast!N$33),0)*$W$1+$B49,\"x\"))","v":"x"},{"$f":"IF(Indtast!O32<>\"\",ROUND((60/$X49*Indtast!O$32),0)*$W$1+$B49,IF(Indtast!O33<>\"\",ROUND((60/$X49*Indtast!O$33),0)*$W$1+$B49,\"x\"))","v":"x"},{"$f":"IF(Indtast!P32<>\"\",ROUND((60/$X49*Indtast!P$32),0)*$W$1+$B49,IF(Indtast!P33<>\"\",ROUND((60/$X49*Indtast!P$33),0)*$W$1+$B49,\"x\"))","v":"x"},{"$f":"IF(Indtast!Q32<>\"\",ROUND((60/$X49*Indtast!Q$32),0)*$W$1+$B49,IF(Indtast!Q33<>\"\",ROUND((60/$X49*Indtast!Q$33),0)*$W$1+$B49,\"x\"))","v":"x"},{"$f":"IF(Indtast!R32<>\"\",ROUND((60/$X49*Indtast!R$32),0)*$W$1+$B49,IF(Indtast!R33<>\"\",ROUND((60/$X49*Indtast!R$33),0)*$W$1+$B49,\"x\"))","v":"x"},{"$f":"IF(Indtast!S32<>\"\",ROUND((60/$X49*Indtast!S$32),0)*$W$1+$B49,IF(Indtast!S33<>\"\",ROUND((60/$X49*Indtast!S$33),0)*$W$1+$B49,\"x\"))","v":"x"},{"$f":"IF(Indtast!T32<>\"\",ROUND((60/$X49*Indtast!T$32),0)*$W$1+$B49,IF(Indtast!T33<>\"\",ROUND((60/$X49*Indtast!T$33),0)*$W$1+$B49,\"x\"))","v":"x"},{"$f":"IF(Indtast!U32<>\"\",ROUND((60/$X49*Indtast!U$32),0)*$W$1+$B49,IF(Indtast!U33<>\"\",ROUND((60/$X49*Indtast!U$33),0)*$W$1+$B49,\"x\"))","v":"x"},{"$f":"IF(Indtast!V32<>\"\",ROUND((60/$X49*Indtast!V$32),0)*$W$1+$B49,IF(Indtast!V33<>\"\",ROUND((60/$X49*Indtast!V$33),0)*$W$1+$B49,\"x\"))","v":"x"},{"$f":"IF(Indtast!W32<>\"\",ROUND((60/$X49*Indtast!W$32),0)*$W$1+$B49,IF(Indtast!W33<>\"\",ROUND((60/$X49*Indtast!W$33),0)*$W$1+$B49,\"x\"))","v":"x"},{"$f":"IF(Indtast!X32<>\"\",ROUND((60/$X49*Indtast!X$32),0)*$W$1+$B49,IF(Indtast!X33<>\"\",ROUND((60/$X49*Indtast!X$33),0)*$W$1+$B49,\"x\"))","v":"x"},{"$f":"IF(Indtast!Y32<>\"\",ROUND((60/$X49*Indtast!Y$32),0)*$W$1+$B49,IF(Indtast!Y33<>\"\",ROUND((60/$X49*Indtast!Y$33),0)*$W$1+$B49,\"x\"))","v":"x"},{"$f":"IF(Indtast!Z32<>\"\",ROUND((60/$X49*Indtast!Z$32),0)*$W$1+$B49,IF(Indtast!Z33<>\"\",ROUND((60/$X49*Indtast!Z$33),0)*$W$1+$B49,\"x\"))","v":"x"},{"$f":"IF(Indtast!AA32<>\"\",ROUND((60/$X49*Indtast!AA$32),0)*$W$1+$B49,IF(Indtast!AA33<>\"\",ROUND((60/$X49*Indtast!AA$33),0)*$W$1+$B49,\"x\"))","v":"x"},{"$f":"IF(Indtast!AB32<>\"\",ROUND((60/$X49*Indtast!AB$32),0)*$W$1+$B49,IF(Indtast!AB33<>\"\",ROUND((60/$X49*Indtast!AB$33),0)*$W$1+$B49,\"x\"))","v":"x"},null,{"$f":"Indtast!$C$32","v":0}]

{"sheet":"Tidsskema kopi","index":11,"n_rows":317,"n_cols":5,"rows_kept":317,"cut":false,"hidden":true,"merged":[]}
["Klasse","Forventet kl.",null,"Resterende omgange","Faktisk tid"]
[{"$f":"Data!$A$6","v":"U15 Mel"},{"$f":"IF(Data!$B$6<>\"\",Data!$B$6)","v":"08:00:00"},{"$f":"IF(B3=FALSE,IF(B2<>FALSE,\"Mål\"),IF(B2<>FALSE,\"Start\"))","v":"Start"},{"$f":"IF(C2=\"Mål\",\"\",IF(C3=\"Mål\",1,IF(C2<>FALSE,D3+1)))","v":4}]
[{"$f":"Data!$A$6","v":"U15 Mel"},{"$f":"IF(Data!$C$6<>\"\",Data!$C$6)","v":"08:18:00"},{"$f":"IF(B4=FALSE,IF(B3<>FALSE,\"Mål\"),IF(B3<>FALSE,\"2. omgang\"))","v":"2. omgang"},3]
[{"$f":"Data!$A$6","v":"U15 Mel"},{"$f":"IF(Data!$D$6<>\"\",Data!$D$6)","v":"08:37:00"},{"$f":"IF(B5=FALSE,IF(B4<>FALSE,\"Mål\"),IF(B4<>FALSE,\"3. omgang\"))","v":"3. omgang"},2]
[{"$f":"Data!$A$6","v":"U15 Mel"},{"$f":"IF(Data!$E$6<>\"\",Data!$E$6)","v":"08:55:00"},{"$f":"IF(B6=FALSE,IF(B5<>FALSE,\"Mål\"),IF(B5<>FALSE,\"4. omgang\"))","v":"4. omgang"},1]
[{"$f":"Data!$A$6","v":"U15 Mel"},{"$f":"IF(Data!$F$6<>\"\",Data!$F$6)","v":"09:13:00"},{"$f":"IF(B7=FALSE,IF(B6<>FALSE,\"Mål\"),IF(B6<>FALSE,\"5. omgang\"))","v":"Mål"},""]
[{"$f":"Data!$A$6","v":"U15 Mel"},{"$f":"IF(Data!$G$6<>\"\",Data!$G$6)","v":false},{"$f":"IF(B8=FALSE,IF(B7<>FALSE,\"Mål\"),IF(B7<>FALSE,\"6. omgang\"))","v":false},false]
[{"$f":"Data!$A$6","v":"U15 Mel"},{"$f":"IF(Data!$H$6<>\"\",Data!$H$6)","v":false},{"$f":"IF(B9=FALSE,IF(B8<>FALSE,\"Mål\"),IF(B8<>FALSE,\"7. omgang\"))","v":false},false]
[{"$f":"Data!$A$6","v":"U15 Mel"},{"$f":"IF(Data!$I$6<>\"\",Data!$I$6)","v":false},{"$f":"IF(B10=FALSE,IF(B9<>FALSE,\"Mål\"),IF(B9<>FALSE,\"8. omgang\"))","v":false},false]
[{"$f":"Data!$A$6","v":"U15 Mel"},{"$f":"IF(Data!$J$6<>\"\",Data!$J$6)","v":false},{"$f":"IF(B11=FALSE,IF(B10<>FALSE,\"Mål\"),IF(B10<>FALSE,\"9. omgang\"))","v":false},false]
[{"$f":"Data!$A$6","v":"U15 Mel"},{"$f":"IF(Data!$K$6<>\"\",Data!$K$6)","v":false},{"$f":"IF(B12=FALSE,IF(B11<>FALSE,\"Mål\"),IF(B11<>FALSE,\"10. omgang\"))","v":false},false]
[{"$f":"Data!$A$6","v":"U15 Mel"},{"$f":"IF(Data!$L$6<>\"\",Data!$L$6)","v":false},{"$f":"IF(B13=FALSE,IF(B12<>FALSE,\"Mål\"),IF(B12<>FALSE,\"11. omgang\"))","v":false},false]
[{"$f":"Data!$A$6","v":"U15 Mel"},{"$f":"IF(Data!$M$6<>\"\",Data!$M$6)","v":false},{"$f":"IF(B14=FALSE,IF(B13<>FALSE,\"Mål\"),IF(B13<>FALSE,\"12. omgang\"))","v":false},false]
[{"$f":"Data!$A$6","v":"U15 Mel"},{"$f":"IF(Data!$N$6<>\"\",Data!$N$6)","v":false},{"$f":"IF(B15=FALSE,IF(B14<>FALSE,\"Mål\"),IF(B14<>FALSE,\"13. omgang\"))","v":false},false]
[{"$f":"Data!$A$6","v":"U15 Mel"},{"$f":"IF(Data!$O$6<>\"\",Data!$O$6)","v":false},{"$f":"IF(B16=FALSE,IF(B15<>FALSE,\"Mål\"),IF(B15<>FALSE,\"14. omgang\"))","v":false},false]
[{"$f":"Data!$A$6","v":"U15 Mel"},{"$f":"IF(Data!$P$6<>\"\",Data!$P$6)","v":false},{"$f":"IF(B17=FALSE,IF(B16<>FALSE,\"Mål\"),IF(B16<>FALSE,\"15. omgang\"))","v":false},false]
[{"$f":"Data!$A$6","v":"U15 Mel"},{"$f":"IF(Data!$Q$6<>\"\",Data!$Q$6)","v":false},{"$f":"IF(B18=FALSE,IF(B17<>FALSE,\"Mål\"),IF(B17<>FALSE,\"16. omgang\"))","v":false},false]
[{"$f":"Data!$A$6","v":"U15 Mel"},{"$f":"IF(Data!$R$6<>\"\",Data!$R$6)","v":false},{"$f":"IF(B19=FALSE,IF(B18<>FALSE,\"Mål\"),IF(B18<>FALSE,\"17. omgang\"))","v":false},false]
[{"$f":"Data!$A$6","v":"U15 Mel"},{"$f":"IF(Data!$S$6<>\"\",Data!$S$6)","v":false},{"$f":"IF(B20=FALSE,IF(B19<>FALSE,\"Mål\"),IF(B19<>FALSE,\"18. omgang\"))","v":false},false]
[{"$f":"Data!$A$6","v":"U15 Mel"},{"$f":"IF(Data!$T$6<>\"\",Data!$T$6)","v":false},{"$f":"IF(B21=FALSE,IF(B20<>FALSE,\"Mål\"),IF(B20<>FALSE,\"19. omgang\"))","v":false},false]
[{"$f":"Data!$A$6","v":"U15 Mel"},{"$f":"IF(Data!$U$6<>\"\",Data!$U$6)","v":false},{"$f":"IF(B22=FALSE,IF(B21<>FALSE,\"Mål\"),IF(B21<>FALSE,\"20. omgang\"))","v":false},false]
[{"$f":"Data!$A$6","v":"U15 Mel"},{"$f":"IF(Data!$V$6<>\"\",Data!$V$6)","v":false},{"$f":"IF(B22=FALSE,IF(B22<>FALSE,\"Mål\"),\"Mål\")","v":false},false]
[{"$f":"Data!$A$9","v":"U17P Mel"},{"$f":"IF(Data!$B$9<>\"\",Data!$B$9)","v":"08:00:00"},{"$f":"IF(B24=FALSE,IF(B23<>FALSE,\"Mål\"),IF(B23<>FALSE,\"Start\"))","v":"Start"},4]
[{"$f":"Data!$A$9","v":"U17P Mel"},{"$f":"IF(Data!$C$9<>\"\",Data!$C$9)","v":"08:19:00"},{"$f":"IF(B25=FALSE,IF(B24<>FALSE,\"Mål\"),IF(B24<>FALSE,\"2. omgang\"))","v":"2. omgang"},3]
[{"$f":"Data!$A$9","v":"U17P Mel"},{"$f":"IF(Data!$D$9<>\"\",Data!$D$9)","v":"08:39:00"},{"$f":"IF(B26=FALSE,IF(B25<>FALSE,\"Mål\"),IF(B25<>FALSE,\"3. omgang\"))","v":"3. omgang"},2]
[{"$f":"Data!$A$9","v":"U17P Mel"},{"$f":"IF(Data!$E$9<>\"\",Data!$E$9)","v":"08:58:00"},{"$f":"IF(B27=FALSE,IF(B26<>FALSE,\"Mål\"),IF(B26<>FALSE,\"4. omgang\"))","v":"4. omgang"},1]
[{"$f":"Data!$A$9","v":"U17P Mel"},{"$f":"IF(Data!$F$9<>\"\",Data!$F$9)","v":"09:18:00"},{"$f":"IF(B28=FALSE,IF(B27<>FALSE,\"Mål\"),IF(B27<>FALSE,\"5. omgang\"))","v":"Mål"},""]
[{"$f":"Data!$A$9","v":"U17P Mel"},{"$f":"IF(Data!$G$9<>\"\",Data!$G$9)","v":false},{"$f":"IF(B29=FALSE,IF(B28<>FALSE,\"Mål\"),IF(B28<>FALSE,\"6. omgang\"))","v":false},false]
[{"$f":"Data!$A$9","v":"U17P Mel"},{"$f":"IF(Data!$H$9<>\"\",Data!$H$9)","v":false},{"$f":"IF(B30=FALSE,IF(B29<>FALSE,\"Mål\"),IF(B29<>FALSE,\"7. omgang\"))","v":false},false]
[{"$f":"Data!$A$9","v":"U17P Mel"},{"$f":"IF(Data!$I$9<>\"\",Data!$I$9)","v":false},{"$f":"IF(B31=FALSE,IF(B30<>FALSE,\"Mål\"),IF(B30<>FALSE,\"8. omgang\"))","v":false},false]
[{"$f":"Data!$A$9","v":"U17P Mel"},{"$f":"IF(Data!$J$9<>\"\",Data!$J$9)","v":false},{"$f":"IF(B32=FALSE,IF(B31<>FALSE,\"Mål\"),IF(B31<>FALSE,\"9. omgang\"))","v":false},false]
[{"$f":"Data!$A$9","v":"U17P Mel"},{"$f":"IF(Data!$K$9<>\"\",Data!$K$9)","v":false},{"$f":"IF(B33=FALSE,IF(B32<>FALSE,\"Mål\"),IF(B32<>FALSE,\"10. omgang\"))","v":false},false]
[{"$f":"Data!$A$9","v":"U17P Mel"},{"$f":"IF(Data!$L$9<>\"\",Data!$L$9)","v":false},{"$f":"IF(B34=FALSE,IF(B33<>FALSE,\"Mål\"),IF(B33<>FALSE,\"11. omgang\"))","v":false},false]
[{"$f":"Data!$A$9","v":"U17P Mel"},{"$f":"IF(Data!$M$9<>\"\",Data!$M$9)","v":false},{"$f":"IF(B35=FALSE,IF(B34<>FALSE,\"Mål\"),IF(B34<>FALSE,\"12. omgang\"))","v":false},false]
[{"$f":"Data!$A$9","v":"U17P Mel"},{"$f":"IF(Data!$N$9<>\"\",Data!$N$9)","v":false},{"$f":"IF(B36=FALSE,IF(B35<>FALSE,\"Mål\"),IF(B35<>FALSE,\"13. omgang\"))","v":false},false]
[{"$f":"Data!$A$9","v":"U17P Mel"},{"$f":"IF(Data!$O$9<>\"\",Data!$O$9)","v":false},{"$f":"IF(B37=FALSE,IF(B36<>FALSE,\"Mål\"),IF(B36<>FALSE,\"14. omgang\"))","v":false},false]
[{"$f":"Data!$A$9","v":"U17P Mel"},{"$f":"IF(Data!$P$9<>\"\",Data!$P$9)","v":false},{"$f":"IF(B38=FALSE,IF(B37<>FALSE,\"Mål\"),IF(B37<>FALSE,\"15. omgang\"))","v":false},false]
[{"$f":"Data!$A$9","v":"U17P Mel"},{"$f":"IF(Data!$Q$9<>\"\",Data!$Q$9)","v":false},{"$f":"IF(B39=FALSE,IF(B38<>FALSE,\"Mål\"),IF(B38<>FALSE,\"16. omgang\"))","v":false},false]
[{"$f":"Data!$A$9","v":"U17P Mel"},{"$f":"IF(Data!$R$9<>\"\",Data!$R$9)","v":false},{"$f":"IF(B40=FALSE,IF(B39<>FALSE,\"Mål\"),IF(B39<>FALSE,\"17. omgang\"))","v":false},false]
[{"$f":"Data!$A$9","v":"U17P Mel"},{"$f":"IF(Data!$S$9<>\"\",Data!$S$9)","v":false},{"$f":"IF(B41=FALSE,IF(B40<>FALSE,\"Mål\"),IF(B40<>FALSE,\"18. omgang\"))","v":false},false]
[{"$f":"Data!$A$9","v":"U17P Mel"},{"$f":"IF(Data!$T$9<>\"\",Data!$T$9)","v":false},{"$f":"IF(B42=FALSE,IF(B41<>FALSE,\"Mål\"),IF(B41<>FALSE,\"19. omgang\"))","v":false},false]
[{"$f":"Data!$A$9","v":"U17P Mel"},{"$f":"IF(Data!$U$9<>\"\",Data!$U$9)","v":false},{"$f":"IF(B43=FALSE,IF(B42<>FALSE,\"Mål\"),IF(B42<>FALSE,\"20. omgang\"))","v":false},false]
[{"$f":"Data!$A$9","v":"U17P Mel"},{"$f":"IF(Data!$V$9<>\"\",Data!$V$9)","v":false},{"$f":"IF(B43=FALSE,IF(B43<>FALSE,\"Mål\"),\"Mål\")","v":false},false]
[{"$f":"Data!$A$12","v":"U15P Mel"},{"$f":"IF(Data!$B$12<>\"\",Data!$B$12)","v":"08:00:00"},{"$f":"IF(B45=FALSE,IF(B44<>FALSE,\"Mål\"),IF(B44<>FALSE,\"Start\"))","v":"Start"},4]
[{"$f":"Data!$A$12","v":"U15P Mel"},{"$f":"IF(Data!$C$12<>\"\",Data!$C$12)","v":"08:19:00"},{"$f":"IF(B46=FALSE,IF(B45<>FALSE,\"Mål\"),IF(B45<>FALSE,\"2. omgang\"))","v":"2. omgang"},3]
[{"$f":"Data!$A$12","v":"U15P Mel"},{"$f":"IF(Data!$D$12<>\"\",Data!$D$12)","v":"08:39:00"},{"$f":"IF(B47=FALSE,IF(B46<>FALSE,\"Mål\"),IF(B46<>FALSE,\"3. omgang\"))","v":"3. omgang"},2]
[{"$f":"Data!$A$12","v":"U15P Mel"},{"$f":"IF(Data!$E$12<>\"\",Data!$E$12)","v":"08:58:00"},{"$f":"IF(B48=FALSE,IF(B47<>FALSE,\"Mål\"),IF(B47<>FALSE,\"4. omgang\"))","v":"4. omgang"},1]
[{"$f":"Data!$A$12","v":"U15P Mel"},{"$f":"IF(Data!$F$12<>\"\",Data!$F$12)","v":"09:18:00"},{"$f":"IF(B49=FALSE,IF(B48<>FALSE,\"Mål\"),IF(B48<>FALSE,\"5. omgang\"))","v":"Mål"},""]
[{"$f":"Data!$A$12","v":"U15P Mel"},{"$f":"IF(Data!$G$12<>\"\",Data!$G$12)","v":false},{"$f":"IF(B50=FALSE,IF(B49<>FALSE,\"Mål\"),IF(B49<>FALSE,\"6. omgang\"))","v":false},false]
[{"$f":"Data!$A$12","v":"U15P Mel"},{"$f":"IF(Data!$H$12<>\"\",Data!$H$12)","v":false},{"$f":"IF(B51=FALSE,IF(B50<>FALSE,\"Mål\"),IF(B50<>FALSE,\"7. omgang\"))","v":false},false]
[{"$f":"Data!$A$12","v":"U15P Mel"},{"$f":"IF(Data!$I$12<>\"\",Data!$I$12)","v":false},{"$f":"IF(B52=FALSE,IF(B51<>FALSE,\"Mål\"),IF(B51<>FALSE,\"8. omgang\"))","v":false},false]
[{"$f":"Data!$A$12","v":"U15P Mel"},{"$f":"IF(Data!$J$12<>\"\",Data!$J$12)","v":false},{"$f":"IF(B53=FALSE,IF(B52<>FALSE,\"Mål\"),IF(B52<>FALSE,\"9. omgang\"))","v":false},false]
[{"$f":"Data!$A$12","v":"U15P Mel"},{"$f":"IF(Data!$K$12<>\"\",Data!$K$12)","v":false},{"$f":"IF(B54=FALSE,IF(B53<>FALSE,\"Mål\"),IF(B53<>FALSE,\"10. omgang\"))","v":false},false]
[{"$f":"Data!$A$12","v":"U15P Mel"},{"$f":"IF(Data!$L$12<>\"\",Data!$L$12)","v":false},{"$f":"IF(B55=FALSE,IF(B54<>FALSE,\"Mål\"),IF(B54<>FALSE,\"11. omgang\"))","v":false},false]
[{"$f":"Data!$A$12","v":"U15P Mel"},{"$f":"IF(Data!$M$12<>\"\",Data!$M$12)","v":false},{"$f":"IF(B56=FALSE,IF(B55<>FALSE,\"Mål\"),IF(B55<>FALSE,\"12. omgang\"))","v":false},false]
[{"$f":"Data!$A$12","v":"U15P Mel"},{"$f":"IF(Data!$N$12<>\"\",Data!$N$12)","v":false},{"$f":"IF(B57=FALSE,IF(B56<>FALSE,\"Mål\"),IF(B56<>FALSE,\"13. omgang\"))","v":false},false]
[{"$f":"Data!$A$12","v":"U15P Mel"},{"$f":"IF(Data!$O$12<>\"\",Data!$O$12)","v":false},{"$f":"IF(B58=FALSE,IF(B57<>FALSE,\"Mål\"),IF(B57<>FALSE,\"14. omgang\"))","v":false},false]
[{"$f":"Data!$A$12","v":"U15P Mel"},{"$f":"IF(Data!$P$12<>\"\",Data!$P$12)","v":false},{"$f":"IF(B59=FALSE,IF(B58<>FALSE,\"Mål\"),IF(B58<>FALSE,\"15. omgang\"))","v":false},false]
[{"$f":"Data!$A$12","v":"U15P Mel"},{"$f":"IF(Data!$Q$12<>\"\",Data!$Q$12)","v":false},{"$f":"IF(B60=FALSE,IF(B59<>FALSE,\"Mål\"),IF(B59<>FALSE,\"16. omgang\"))","v":false},false]
[{"$f":"Data!$A$12","v":"U15P Mel"},{"$f":"IF(Data!$R$12<>\"\",Data!$R$12)","v":false},{"$f":"IF(B61=FALSE,IF(B60<>FALSE,\"Mål\"),IF(B60<>FALSE,\"17. omgang\"))","v":false},false]
[{"$f":"Data!$A$12","v":"U15P Mel"},{"$f":"IF(Data!$S$12<>\"\",Data!$S$12)","v":false},{"$f":"IF(B62=FALSE,IF(B61<>FALSE,\"Mål\"),IF(B61<>FALSE,\"18. omgang\"))","v":false},false]
[{"$f":"Data!$A$12","v":"U15P Mel"},{"$f":"IF(Data!$T$12<>\"\",Data!$T$12)","v":false},{"$f":"IF(B63=FALSE,IF(B62<>FALSE,\"Mål\"),IF(B62<>FALSE,\"19. omgang\"))","v":false},false]
[{"$f":"Data!$A$12","v":"U15P Mel"},{"$f":"IF(Data!$U$12<>\"\",Data!$U$12)","v":false},{"$f":"IF(B64=FALSE,IF(B63<>FALSE,\"Mål\"),IF(B63<>FALSE,\"20. omgang\"))","v":false},false]
[{"$f":"Data!$A$12","v":"U15P Mel"},{"$f":"IF(Data!$V$12<>\"\",Data!$V$12)","v":false},{"$f":"IF(B64=FALSE,IF(B64<>FALSE,\"Mål\"),\"Mål\")","v":false},false]
[{"$f":"Data!$A$15","v":"U13 Mel"},{"$f":"IF(Data!$B$15<>\"\",Data!$B$15)","v":"08:05:00"},{"$f":"IF(B66=FALSE,IF(B65<>FALSE,\"Mål\"),IF(B65<>FALSE,\"Start\"))","v":"Start"},2]
[{"$f":"Data!$A$15","v":"U13 Mel"},{"$f":"IF(Data!$C$15<>\"\",Data!$C$15)","v":"08:26:00"},{"$f":"IF(B67=FALSE,IF(B66<>FALSE,\"Mål\"),IF(B66<>FALSE,\"2. omgang\"))","v":"2. omgang"},{"$f":"IF(C66=\"Mål\",\"\",IF(C67=\"Mål\",1,IF(C66<>FALSE,D67+1)))","v":1}]
[{"$f":"Data!$A$15","v":"U13 Mel"},{"$f":"IF(Data!$D$15<>\"\",Data!$D$15)","v":"08:48:00"},{"$f":"IF(B68=FALSE,IF(B67<>FALSE,\"Mål\"),IF(B67<>FALSE,\"3. omgang\"))","v":"Mål"},""]
[{"$f":"Data!$A$15","v":"U13 Mel"},{"$f":"IF(Data!$E$15<>\"\",Data!$E$15)","v":false},{"$f":"IF(B69=FALSE,IF(B68<>FALSE,\"Mål\"),IF(B68<>FALSE,\"4. omgang\"))","v":false},false]
[{"$f":"Data!$A$15","v":"U13 Mel"},{"$f":"IF(Data!$F$15<>\"\",Data!$F$15)","v":false},{"$f":"IF(B70=FALSE,IF(B69<>FALSE,\"Mål\"),IF(B69<>FALSE,\"5. omgang\"))","v":false},false]
[{"$f":"Data!$A$15","v":"U13 Mel"},{"$f":"IF(Data!$G$15<>\"\",Data!$G$15)","v":false},{"$f":"IF(B71=FALSE,IF(B70<>FALSE,\"Mål\"),IF(B70<>FALSE,\"6. omgang\"))","v":false},false]
[{"$f":"Data!$A$15","v":"U13 Mel"},{"$f":"IF(Data!$H$15<>\"\",Data!$H$15)","v":false},{"$f":"IF(B72=FALSE,IF(B71<>FALSE,\"Mål\"),IF(B71<>FALSE,\"7. omgang\"))","v":false},false]
[{"$f":"Data!$A$15","v":"U13 Mel"},{"$f":"IF(Data!$I$15<>\"\",Data!$I$15)","v":false},{"$f":"IF(B73=FALSE,IF(B72<>FALSE,\"Mål\"),IF(B72<>FALSE,\"8. omgang\"))","v":false},false]
[{"$f":"Data!$A$15","v":"U13 Mel"},{"$f":"IF(Data!$J$15<>\"\",Data!$J$15)","v":false},{"$f":"IF(B74=FALSE,IF(B73<>FALSE,\"Mål\"),IF(B73<>FALSE,\"9. omgang\"))","v":false},false]
[{"$f":"Data!$A$15","v":"U13 Mel"},{"$f":"IF(Data!$K$15<>\"\",Data!$K$15)","v":false},{"$f":"IF(B75=FALSE,IF(B74<>FALSE,\"Mål\"),IF(B74<>FALSE,\"10. omgang\"))","v":false},false]
[{"$f":"Data!$A$15","v":"U13 Mel"},{"$f":"IF(Data!$L$15<>\"\",Data!$L$15)","v":false},{"$f":"IF(B76=FALSE,IF(B75<>FALSE,\"Mål\"),IF(B75<>FALSE,\"11. omgang\"))","v":false},false]
[{"$f":"Data!$A$15","v":"U13 Mel"},{"$f":"IF(Data!$M$15<>\"\",Data!$M$15)","v":false},{"$f":"IF(B77=FALSE,IF(B76<>FALSE,\"Mål\"),IF(B76<>FALSE,\"12. omgang\"))","v":false},false]
[{"$f":"Data!$A$15","v":"U13 Mel"},{"$f":"IF(Data!$N$15<>\"\",Data!$N$15)","v":false},{"$f":"IF(B78=FALSE,IF(B77<>FALSE,\"Mål\"),IF(B77<>FALSE,\"13. omgang\"))","v":false},false]
[{"$f":"Data!$A$15","v":"U13 Mel"},{"$f":"IF(Data!$O$15<>\"\",Data!$O$15)","v":false},{"$f":"IF(B79=FALSE,IF(B78<>FALSE,\"Mål\"),IF(B78<>FALSE,\"14. omgang\"))","v":false},false]
[{"$f":"Data!$A$15","v":"U13 Mel"},{"$f":"IF(Data!$P$15<>\"\",Data!$P$15)","v":false},{"$f":"IF(B80=FALSE,IF(B79<>FALSE,\"Mål\"),IF(B79<>FALSE,\"15. omgang\"))","v":false},false]
[{"$f":"Data!$A$15","v":"U13 Mel"},{"$f":"IF(Data!$Q$15<>\"\",Data!$Q$15)","v":false},{"$f":"IF(B81=FALSE,IF(B80<>FALSE,\"Mål\"),IF(B80<>FALSE,\"16. omgang\"))","v":false},false]
[{"$f":"Data!$A$15","v":"U13 Mel"},{"$f":"IF(Data!$R$15<>\"\",Data!$R$15)","v":false},{"$f":"IF(B82=FALSE,IF(B81<>FALSE,\"Mål\"),IF(B81<>FALSE,\"17. omgang\"))","v":false},false]
[{"$f":"Data!$A$15","v":"U13 Mel"},{"$f":"IF(Data!$S$15<>\"\",Data!$S$15)","v":false},{"$f":"IF(B83=FALSE,IF(B82<>FALSE,\"Mål\"),IF(B82<>FALSE,\"18. omgang\"))","v":false},false]
[{"$f":"Data!$A$15","v":"U13 Mel"},{"$f":"IF(Data!$T$15<>\"\",Data!$T$15)","v":false},{"$f":"IF(B84=FALSE,IF(B83<>FALSE,\"Mål\"),IF(B83<>FALSE,\"19. omgang\"))","v":false},false]
[{"$f":"Data!$A$15","v":"U13 Mel"},{"$f":"IF(Data!$U$15<>\"\",Data!$U$15)","v":false},{"$f":"IF(B85=FALSE,IF(B84<>FALSE,\"Mål\"),IF(B84<>FALSE,\"20. omgang\"))","v":false},false]
[{"$f":"Data!$A$15","v":"U13 Mel"},{"$f":"IF(Data!$V$15<>\"\",Data!$V$15)","v":false},{"$f":"IF(B85=FALSE,IF(B85<>FALSE,\"Mål\"),\"Mål\")","v":false},false]
[{"$f":"Data!$A$18","v":"U13P Mel"},{"$f":"IF(Data!$B$18<>\"\",Data!$B$18)","v":"08:05:00"},{"$f":"IF(B87=FALSE,IF(B86<>FALSE,\"Mål\"),IF(B86<>FALSE,\"Start\"))","v":"Start"},2]
[{"$f":"Data!$A$18","v":"U13P Mel"},{"$f":"IF(Data!$C$18<>\"\",Data!$C$18)","v":"08:27:00"},{"$f":"IF(B88=FALSE,IF(B87<>FALSE,\"Mål\"),IF(B87<>FALSE,\"2. omgang\"))","v":"2. omgang"},1]
[{"$f":"Data!$A$18","v":"U13P Mel"},{"$f":"IF(Data!$D$18<>\"\",Data!$D$18)","v":"08:49:00"},{"$f":"IF(B89=FALSE,IF(B88<>FALSE,\"Mål\"),IF(B88<>FALSE,\"3. omgang\"))","v":"Mål"},""]
[{"$f":"Data!$A$18","v":"U13P Mel"},{"$f":"IF(Data!$E$18<>\"\",Data!$E$18)","v":false},{"$f":"IF(B90=FALSE,IF(B89<>FALSE,\"Mål\"),IF(B89<>FALSE,\"4. omgang\"))","v":false},false]
[{"$f":"Data!$A$18","v":"U13P Mel"},{"$f":"IF(Data!$F$18<>\"\",Data!$F$18)","v":false},{"$f":"IF(B91=FALSE,IF(B90<>FALSE,\"Mål\"),IF(B90<>FALSE,\"5. omgang\"))","v":false},false]
[{"$f":"Data!$A$18","v":"U13P Mel"},{"$f":"IF(Data!$G$18<>\"\",Data!$G$18)","v":false},{"$f":"IF(B92=FALSE,IF(B91<>FALSE,\"Mål\"),IF(B91<>FALSE,\"6. omgang\"))","v":false},false]
[{"$f":"Data!$A$18","v":"U13P Mel"},{"$f":"IF(Data!$H$18<>\"\",Data!$H$18)","v":false},{"$f":"IF(B93=FALSE,IF(B92<>FALSE,\"Mål\"),IF(B92<>FALSE,\"7. omgang\"))","v":false},false]
[{"$f":"Data!$A$18","v":"U13P Mel"},{"$f":"IF(Data!$I$18<>\"\",Data!$I$18)","v":false},{"$f":"IF(B94=FALSE,IF(B93<>FALSE,\"Mål\"),IF(B93<>FALSE,\"8. omgang\"))","v":false},false]
[{"$f":"Data!$A$18","v":"U13P Mel"},{"$f":"IF(Data!$J$18<>\"\",Data!$J$18)","v":false},{"$f":"IF(B95=FALSE,IF(B94<>FALSE,\"Mål\"),IF(B94<>FALSE,\"9. omgang\"))","v":false},false]
[{"$f":"Data!$A$18","v":"U13P Mel"},{"$f":"IF(Data!$K$18<>\"\",Data!$K$18)","v":false},{"$f":"IF(B96=FALSE,IF(B95<>FALSE,\"Mål\"),IF(B95<>FALSE,\"10. omgang\"))","v":false},false]
[{"$f":"Data!$A$18","v":"U13P Mel"},{"$f":"IF(Data!$L$18<>\"\",Data!$L$18)","v":false},{"$f":"IF(B97=FALSE,IF(B96<>FALSE,\"Mål\"),IF(B96<>FALSE,\"11. omgang\"))","v":false},false]
[{"$f":"Data!$A$18","v":"U13P Mel"},{"$f":"IF(Data!$M$18<>\"\",Data!$M$18)","v":false},{"$f":"IF(B98=FALSE,IF(B97<>FALSE,\"Mål\"),IF(B97<>FALSE,\"12. omgang\"))","v":false},false]
[{"$f":"Data!$A$18","v":"U13P Mel"},{"$f":"IF(Data!$N$18<>\"\",Data!$N$18)","v":false},{"$f":"IF(B99=FALSE,IF(B98<>FALSE,\"Mål\"),IF(B98<>FALSE,\"13. omgang\"))","v":false},false]
[{"$f":"Data!$A$18","v":"U13P Mel"},{"$f":"IF(Data!$O$18<>\"\",Data!$O$18)","v":false},{"$f":"IF(B100=FALSE,IF(B99<>FALSE,\"Mål\"),IF(B99<>FALSE,\"14. omgang\"))","v":false},false]
[{"$f":"Data!$A$18","v":"U13P Mel"},{"$f":"IF(Data!$P$18<>\"\",Data!$P$18)","v":false},{"$f":"IF(B101=FALSE,IF(B100<>FALSE,\"Mål\"),IF(B100<>FALSE,\"15. omgang\"))","v":false},false]
[{"$f":"Data!$A$18","v":"U13P Mel"},{"$f":"IF(Data!$Q$18<>\"\",Data!$Q$18)","v":false},{"$f":"IF(B102=FALSE,IF(B101<>FALSE,\"Mål\"),IF(B101<>FALSE,\"16. omgang\"))","v":false},false]
[{"$f":"Data!$A$18","v":"U13P Mel"},{"$f":"IF(Data!$R$18<>\"\",Data!$R$18)","v":false},{"$f":"IF(B103=FALSE,IF(B102<>FALSE,\"Mål\"),IF(B102<>FALSE,\"17. omgang\"))","v":false},false]
[{"$f":"Data!$A$18","v":"U13P Mel"},{"$f":"IF(Data!$S$18<>\"\",Data!$S$18)","v":false},{"$f":"IF(B104=FALSE,IF(B103<>FALSE,\"Mål\"),IF(B103<>FALSE,\"18. omgang\"))","v":false},false]
[{"$f":"Data!$A$18","v":"U13P Mel"},{"$f":"IF(Data!$T$18<>\"\",Data!$T$18)","v":false},{"$f":"IF(B105=FALSE,IF(B104<>FALSE,\"Mål\"),IF(B104<>FALSE,\"19. omgang\"))","v":false},false]
[{"$f":"Data!$A$18","v":"U13P Mel"},{"$f":"IF(Data!$U$18<>\"\",Data!$U$18)","v":false},{"$f":"IF(B106=FALSE,IF(B105<>FALSE,\"Mål\"),IF(B105<>FALSE,\"20. omgang\"))","v":false},false]
[{"$f":"Data!$A$18","v":"U13P Mel"},{"$f":"IF(Data!$V$18<>\"\",Data!$V$18)","v":false},{"$f":"IF(B106=FALSE,IF(B106<>FALSE,\"Mål\"),\"Mål\")","v":false},false]
[{"$f":"Data!$A$21","v":"U11 Mel"},{"$f":"IF(Data!$B$21<>\"\",Data!$B$21)","v":"08:10:00"},{"$f":"IF(B108=FALSE,IF(B107<>FALSE,\"Mål\"),IF(B107<>FALSE,\"Start\"))","v":"Start"},1]
[{"$f":"Data!$A$21","v":"U11 Mel"},{"$f":"IF(Data!$C$21<>\"\",Data!$C$21)","v":"08:32:00"},{"$f":"IF(B109=FALSE,IF(B108<>FALSE,\"Mål\"),IF(B108<>FALSE,\"2. omgang\"))","v":"Mål"},""]
[{"$f":"Data!$A$21","v":"U11 Mel"},{"$f":"IF(Data!$D$21<>\"\",Data!$D$21)","v":false},{"$f":"IF(B110=FALSE,IF(B109<>FALSE,\"Mål\"),IF(B109<>FALSE,\"3. omgang\"))","v":false},false]
[{"$f":"Data!$A$21","v":"U11 Mel"},{"$f":"IF(Data!$E$21<>\"\",Data!$E$21)","v":false},{"$f":"IF(B111=FALSE,IF(B110<>FALSE,\"Mål\"),IF(B110<>FALSE,\"4. omgang\"))","v":false},false]
[{"$f":"Data!$A$21","v":"U11 Mel"},{"$f":"IF(Data!$F$21<>\"\",Data!$F$21)","v":false},{"$f":"IF(B112=FALSE,IF(B111<>FALSE,\"Mål\"),IF(B111<>FALSE,\"5. omgang\"))","v":false},false]
[{"$f":"Data!$A$21","v":"U11 Mel"},{"$f":"IF(Data!$G$21<>\"\",Data!$G$21)","v":false},{"$f":"IF(B113=FALSE,IF(B112<>FALSE,\"Mål\"),IF(B112<>FALSE,\"6. omgang\"))","v":false},false]
[{"$f":"Data!$A$21","v":"U11 Mel"},{"$f":"IF(Data!$H$21<>\"\",Data!$H$21)","v":false},{"$f":"IF(B114=FALSE,IF(B113<>FALSE,\"Mål\"),IF(B113<>FALSE,\"7. omgang\"))","v":false},false]
[{"$f":"Data!$A$21","v":"U11 Mel"},{"$f":"IF(Data!$I$21<>\"\",Data!$I$21)","v":false},{"$f":"IF(B115=FALSE,IF(B114<>FALSE,\"Mål\"),IF(B114<>FALSE,\"8. omgang\"))","v":false},false]
[{"$f":"Data!$A$21","v":"U11 Mel"},{"$f":"IF(Data!$J$21<>\"\",Data!$J$21)","v":false},{"$f":"IF(B116=FALSE,IF(B115<>FALSE,\"Mål\"),IF(B115<>FALSE,\"9. omgang\"))","v":false},false]
[{"$f":"Data!$A$21","v":"U11 Mel"},{"$f":"IF(Data!$K$21<>\"\",Data!$K$21)","v":false},{"$f":"IF(B117=FALSE,IF(B116<>FALSE,\"Mål\"),IF(B116<>FALSE,\"10. omgang\"))","v":false},false]
[{"$f":"Data!$A$21","v":"U11 Mel"},{"$f":"IF(Data!$L$21<>\"\",Data!$L$21)","v":false},{"$f":"IF(B118=FALSE,IF(B117<>FALSE,\"Mål\"),IF(B117<>FALSE,\"11. omgang\"))","v":false},false]
[{"$f":"Data!$A$21","v":"U11 Mel"},{"$f":"IF(Data!$M$21<>\"\",Data!$M$21)","v":false},{"$f":"IF(B119=FALSE,IF(B118<>FALSE,\"Mål\"),IF(B118<>FALSE,\"12. omgang\"))","v":false},false]
[{"$f":"Data!$A$21","v":"U11 Mel"},{"$f":"IF(Data!$N$21<>\"\",Data!$N$21)","v":false},{"$f":"IF(B120=FALSE,IF(B119<>FALSE,\"Mål\"),IF(B119<>FALSE,\"13. omgang\"))","v":false},false]
[{"$f":"Data!$A$21","v":"U11 Mel"},{"$f":"IF(Data!$O$21<>\"\",Data!$O$21)","v":false},{"$f":"IF(B121=FALSE,IF(B120<>FALSE,\"Mål\"),IF(B120<>FALSE,\"14. omgang\"))","v":false},false]
[{"$f":"Data!$A$21","v":"U11 Mel"},{"$f":"IF(Data!$P$21<>\"\",Data!$P$21)","v":false},{"$f":"IF(B122=FALSE,IF(B121<>FALSE,\"Mål\"),IF(B121<>FALSE,\"15. omgang\"))","v":false},false]
[{"$f":"Data!$A$21","v":"U11 Mel"},{"$f":"IF(Data!$Q$21<>\"\",Data!$Q$21)","v":false},{"$f":"IF(B123=FALSE,IF(B122<>FALSE,\"Mål\"),IF(B122<>FALSE,\"16. omgang\"))","v":false},false]
[{"$f":"Data!$A$21","v":"U11 Mel"},{"$f":"IF(Data!$R$21<>\"\",Data!$R$21)","v":false},{"$f":"IF(B124=FALSE,IF(B123<>FALSE,\"Mål\"),IF(B123<>FALSE,\"17. omgang\"))","v":false},false]
[{"$f":"Data!$A$21","v":"U11 Mel"},{"$f":"IF(Data!$S$21<>\"\",Data!$S$21)","v":false},{"$f":"IF(B125=FALSE,IF(B124<>FALSE,\"Mål\"),IF(B124<>FALSE,\"18. omgang\"))","v":false},false]
[{"$f":"Data!$A$21","v":"U11 Mel"},{"$f":"IF(Data!$T$21<>\"\",Data!$T$21)","v":false},{"$f":"IF(B126=FALSE,IF(B125<>FALSE,\"Mål\"),IF(B125<>FALSE,\"19. omgang\"))","v":false},false]
[{"$f":"Data!$A$21","v":"U11 Mel"},{"$f":"IF(Data!$U$21<>\"\",Data!$U$21)","v":false},{"$f":"IF(B127=FALSE,IF(B126<>FALSE,\"Mål\"),IF(B126<>FALSE,\"20. omgang\"))","v":false},false]
[{"$f":"Data!$A$21","v":"U11 Mel"},{"$f":"IF(Data!$V$21<>\"\",Data!$V$21)","v":false},{"$f":"IF(B127=FALSE,IF(B127<>FALSE,\"Mål\"),\"Mål\")","v":false},false]
[{"$f":"Data!$A$24","v":"U11P Mel"},{"$f":"IF(Data!$B$24<>\"\",Data!$B$24)","v":"08:10:00"},{"$f":"IF(B129=FALSE,IF(B128<>FALSE,\"Mål\"),IF(B128<>FALSE,\"Start\"))","v":"Start"},1]
[{"$f":"Data!$A$24","v":"U11P Mel"},{"$f":"IF(Data!$C$24<>\"\",Data!$C$24)","v":"08:34:00"},{"$f":"IF(B130=FALSE,IF(B129<>FALSE,\"Mål\"),IF(B129<>FALSE,\"2. omgang\"))","v":"Mål"},""]
[{"$f":"Data!$A$24","v":"U11P Mel"},{"$f":"IF(Data!$D$24<>\"\",Data!$D$24)","v":false},{"$f":"IF(B131=FALSE,IF(B130<>FALSE,\"Mål\"),IF(B130<>FALSE,\"3. omgang\"))","v":false},{"$f":"IF(C130=\"Mål\",\"\",IF(C131=\"Mål\",1,IF(C130<>FALSE,D131+1)))","v":false}]
[{"$f":"Data!$A$24","v":"U11P Mel"},{"$f":"IF(Data!$E$24<>\"\",Data!$E$24)","v":false},{"$f":"IF(B132=FALSE,IF(B131<>FALSE,\"Mål\"),IF(B131<>FALSE,\"4. omgang\"))","v":false},false]
[{"$f":"Data!$A$24","v":"U11P Mel"},{"$f":"IF(Data!$F$24<>\"\",Data!$F$24)","v":false},{"$f":"IF(B133=FALSE,IF(B132<>FALSE,\"Mål\"),IF(B132<>FALSE,\"5. omgang\"))","v":false},false]
[{"$f":"Data!$A$24","v":"U11P Mel"},{"$f":"IF(Data!$G$24<>\"\",Data!$G$24)","v":false},{"$f":"IF(B134=FALSE,IF(B133<>FALSE,\"Mål\"),IF(B133<>FALSE,\"6. omgang\"))","v":false},false]
[{"$f":"Data!$A$24","v":"U11P Mel"},{"$f":"IF(Data!$H$24<>\"\",Data!$H$24)","v":false},{"$f":"IF(B135=FALSE,IF(B134<>FALSE,\"Mål\"),IF(B134<>FALSE,\"7. omgang\"))","v":false},false]
[{"$f":"Data!$A$24","v":"U11P Mel"},{"$f":"IF(Data!$I$24<>\"\",Data!$I$24)","v":false},{"$f":"IF(B136=FALSE,IF(B135<>FALSE,\"Mål\"),IF(B135<>FALSE,\"8. omgang\"))","v":false},false]
[{"$f":"Data!$A$24","v":"U11P Mel"},{"$f":"IF(Data!$J$24<>\"\",Data!$J$24)","v":false},{"$f":"IF(B137=FALSE,IF(B136<>FALSE,\"Mål\"),IF(B136<>FALSE,\"9. omgang\"))","v":false},false]
[{"$f":"Data!$A$24","v":"U11P Mel"},{"$f":"IF(Data!$K$24<>\"\",Data!$K$24)","v":false},{"$f":"IF(B138=FALSE,IF(B137<>FALSE,\"Mål\"),IF(B137<>FALSE,\"10. omgang\"))","v":false},false]
[{"$f":"Data!$A$24","v":"U11P Mel"},{"$f":"IF(Data!$L$24<>\"\",Data!$L$24)","v":false},{"$f":"IF(B139=FALSE,IF(B138<>FALSE,\"Mål\"),IF(B138<>FALSE,\"11. omgang\"))","v":false},false]
[{"$f":"Data!$A$24","v":"U11P Mel"},{"$f":"IF(Data!$M$24<>\"\",Data!$M$24)","v":false},{"$f":"IF(B140=FALSE,IF(B139<>FALSE,\"Mål\"),IF(B139<>FALSE,\"12. omgang\"))","v":false},false]
[{"$f":"Data!$A$24","v":"U11P Mel"},{"$f":"IF(Data!$N$24<>\"\",Data!$N$24)","v":false},{"$f":"IF(B141=FALSE,IF(B140<>FALSE,\"Mål\"),IF(B140<>FALSE,\"13. omgang\"))","v":false},false]
[{"$f":"Data!$A$24","v":"U11P Mel"},{"$f":"IF(Data!$O$24<>\"\",Data!$O$24)","v":false},{"$f":"IF(B142=FALSE,IF(B141<>FALSE,\"Mål\"),IF(B141<>FALSE,\"14. omgang\"))","v":false},false]
[{"$f":"Data!$A$24","v":"U11P Mel"},{"$f":"IF(Data!$P$24<>\"\",Data!$P$24)","v":false},{"$f":"IF(B143=FALSE,IF(B142<>FALSE,\"Mål\"),IF(B142<>FALSE,\"15. omgang\"))","v":false},false]
[{"$f":"Data!$A$24","v":"U11P Mel"},{"$f":"IF(Data!$Q$24<>\"\",Data!$Q$24)","v":false},{"$f":"IF(B144=FALSE,IF(B143<>FALSE,\"Mål\"),IF(B143<>FALSE,\"16. omgang\"))","v":false},false]
[{"$f":"Data!$A$24","v":"U11P Mel"},{"$f":"IF(Data!$R$24<>\"\",Data!$R$24)","v":false},{"$f":"IF(B145=FALSE,IF(B144<>FALSE,\"Mål\"),IF(B144<>FALSE,\"17. omgang\"))","v":false},false]
[{"$f":"Data!$A$24","v":"U11P Mel"},{"$f":"IF(Data!$S$24<>\"\",Data!$S$24)","v":false},{"$f":"IF(B146=FALSE,IF(B145<>FALSE,\"Mål\"),IF(B145<>FALSE,\"18. omgang\"))","v":false},false]
[{"$f":"Data!$A$24","v":"U11P Mel"},{"$f":"IF(Data!$T$24<>\"\",Data!$T$24)","v":false},{"$f":"IF(B147=FALSE,IF(B146<>FALSE,\"Mål\"),IF(B146<>FALSE,\"19. omgang\"))","v":false},false]
[{"$f":"Data!$A$24","v":"U11P Mel"},{"$f":"IF(Data!$U$24<>\"\",Data!$U$24)","v":false},{"$f":"IF(B148=FALSE,IF(B147<>FALSE,\"Mål\"),IF(B147<>FALSE,\"20. omgang\"))","v":false},false]
[{"$f":"Data!$A$24","v":"U11P Mel"},{"$f":"IF(Data!$V$24<>\"\",Data!$V$24)","v":false},{"$f":"IF(B148=FALSE,IF(B148<>FALSE,\"Mål\"),\"Mål\")","v":false},false]
[{"$f":"Data!$A$27","v":"U19P Mel"},{"$f":"IF(Data!$B$27<>\"\",Data!$B$27)","v":"10:00:00"},{"$f":"IF(B150=FALSE,IF(B149<>FALSE,\"Mål\"),IF(B149<>FALSE,\"Start\"))","v":"Start"},6]
[{"$f":"Data!$A$27","v":"U19P Mel"},{"$f":"IF(Data!$C$27<>\"\",Data!$C$27)","v":"10:18:00"},{"$f":"IF(B151=FALSE,IF(B150<>FALSE,\"Mål\"),IF(B150<>FALSE,\"2. omgang\"))","v":"2. omgang"},5]
[{"$f":"Data!$A$27","v":"U19P Mel"},{"$f":"IF(Data!$D$27<>\"\",Data!$D$27)","v":"10:37:00"},{"$f":"IF(B152=FALSE,IF(B151<>FALSE,\"Mål\"),IF(B151<>FALSE,\"3. omgang\"))","v":"3. omgang"},4]
[{"$f":"Data!$A$27","v":"U19P Mel"},{"$f":"IF(Data!$E$27<>\"\",Data!$E$27)","v":"10:55:00"},{"$f":"IF(B153=FALSE,IF(B152<>FALSE,\"Mål\"),IF(B152<>FALSE,\"4. omgang\"))","v":"4. omgang"},3]
[{"$f":"Data!$A$27","v":"U19P Mel"},{"$f":"IF(Data!$F$27<>\"\",Data!$F$27)","v":"11:13:00"},{"$f":"IF(B154=FALSE,IF(B153<>FALSE,\"Mål\"),IF(B153<>FALSE,\"5. omgang\"))","v":"5. omgang"},2]
[{"$f":"Data!$A$27","v":"U19P Mel"},{"$f":"IF(Data!$G$27<>\"\",Data!$G$27)","v":"11:32:00"},{"$f":"IF(B155=FALSE,IF(B154<>FALSE,\"Mål\"),IF(B154<>FALSE,\"6. omgang\"))","v":"6. omgang"},1]
[{"$f":"Data!$A$27","v":"U19P Mel"},{"$f":"IF(Data!$H$27<>\"\",Data!$H$27)","v":"11:50:00"},{"$f":"IF(B156=FALSE,IF(B155<>FALSE,\"Mål\"),IF(B155<>FALSE,\"7. omgang\"))","v":"Mål"},""]
[{"$f":"Data!$A$27","v":"U19P Mel"},{"$f":"IF(Data!$I$27<>\"\",Data!$I$27)","v":false},{"$f":"IF(B157=FALSE,IF(B156<>FALSE,\"Mål\"),IF(B156<>FALSE,\"8. omgang\"))","v":false},false]
[{"$f":"Data!$A$27","v":"U19P Mel"},{"$f":"IF(Data!$J$27<>\"\",Data!$J$27)","v":false},{"$f":"IF(B158=FALSE,IF(B157<>FALSE,\"Mål\"),IF(B157<>FALSE,\"9. omgang\"))","v":false},false]
[{"$f":"Data!$A$27","v":"U19P Mel"},{"$f":"IF(Data!$K$27<>\"\",Data!$K$27)","v":false},{"$f":"IF(B159=FALSE,IF(B158<>FALSE,\"Mål\"),IF(B158<>FALSE,\"10. omgang\"))","v":false},false]
[{"$f":"Data!$A$27","v":"U19P Mel"},{"$f":"IF(Data!$L$27<>\"\",Data!$L$27)","v":false},{"$f":"IF(B160=FALSE,IF(B159<>FALSE,\"Mål\"),IF(B159<>FALSE,\"11. omgang\"))","v":false},false]
[{"$f":"Data!$A$27","v":"U19P Mel"},{"$f":"IF(Data!$M$27<>\"\",Data!$M$27)","v":false},{"$f":"IF(B161=FALSE,IF(B160<>FALSE,\"Mål\"),IF(B160<>FALSE,\"12. omgang\"))","v":false},false]
[{"$f":"Data!$A$27","v":"U19P Mel"},{"$f":"IF(Data!$N$27<>\"\",Data!$N$27)","v":false},{"$f":"IF(B162=FALSE,IF(B161<>FALSE,\"Mål\"),IF(B161<>FALSE,\"13. omgang\"))","v":false},false]
[{"$f":"Data!$A$27","v":"U19P Mel"},{"$f":"IF(Data!$O$27<>\"\",Data!$O$27)","v":false},{"$f":"IF(B163=FALSE,IF(B162<>FALSE,\"Mål\"),IF(B162<>FALSE,\"14. omgang\"))","v":false},false]
[{"$f":"Data!$A$27","v":"U19P Mel"},{"$f":"IF(Data!$P$27<>\"\",Data!$P$27)","v":false},{"$f":"IF(B164=FALSE,IF(B163<>FALSE,\"Mål\"),IF(B163<>FALSE,\"15. omgang\"))","v":false},false]
[{"$f":"Data!$A$27","v":"U19P Mel"},{"$f":"IF(Data!$Q$27<>\"\",Data!$Q$27)","v":false},{"$f":"IF(B165=FALSE,IF(B164<>FALSE,\"Mål\"),IF(B164<>FALSE,\"16. omgang\"))","v":false},false]
[{"$f":"Data!$A$27","v":"U19P Mel"},{"$f":"IF(Data!$R$27<>\"\",Data!$R$27)","v":false},{"$f":"IF(B166=FALSE,IF(B165<>FALSE,\"Mål\"),IF(B165<>FALSE,\"17. omgang\"))","v":false},false]
[{"$f":"Data!$A$27","v":"U19P Mel"},{"$f":"IF(Data!$S$27<>\"\",Data!$S$27)","v":false},{"$f":"IF(B167=FALSE,IF(B166<>FALSE,\"Mål\"),IF(B166<>FALSE,\"18. omgang\"))","v":false},false]
[{"$f":"Data!$A$27","v":"U19P Mel"},{"$f":"IF(Data!$T$27<>\"\",Data!$T$27)","v":false},{"$f":"IF(B168=FALSE,IF(B167<>FALSE,\"Mål\"),IF(B167<>FALSE,\"19. omgang\"))","v":false},false]
[{"$f":"Data!$A$27","v":"U19P Mel"},{"$f":"IF(Data!$U$27<>\"\",Data!$U$27)","v":false},{"$f":"IF(B169=FALSE,IF(B168<>FALSE,\"Mål\"),IF(B168<>FALSE,\"20. omgang\"))","v":false},false]
[{"$f":"Data!$A$27","v":"U19P Mel"},{"$f":"IF(Data!$V$27<>\"\",Data!$V$27)","v":false},{"$f":"IF(B169=FALSE,IF(B169<>FALSE,\"Mål\"),\"Mål\")","v":false},false]
[{"$f":"Data!$A$30","v":"U17 Mel"},{"$f":"IF(Data!$B$30<>\"\",Data!$B$30)","v":"10:00:00"},{"$f":"IF(B171=FALSE,IF(B170<>FALSE,\"Mål\"),IF(B170<>FALSE,\"Start\"))","v":"Start"},7]
[{"$f":"Data!$A$30","v":"U17 Mel"},{"$f":"IF(Data!$C$30<>\"\",Data!$C$30)","v":"10:17:00"},{"$f":"IF(B172=FALSE,IF(B171<>FALSE,\"Mål\"),IF(B171<>FALSE,\"2. omgang\"))","v":"2. omgang"},6]
[{"$f":"Data!$A$30","v":"U17 Mel"},{"$f":"IF(Data!$D$30<>\"\",Data!$D$30)","v":"10:34:00"},{"$f":"IF(B173=FALSE,IF(B172<>FALSE,\"Mål\"),IF(B172<>FALSE,\"3. omgang\"))","v":"3. omgang"},5]
[{"$f":"Data!$A$30","v":"U17 Mel"},{"$f":"IF(Data!$E$30<>\"\",Data!$E$30)","v":"10:51:00"},{"$f":"IF(B174=FALSE,IF(B173<>FALSE,\"Mål\"),IF(B173<>FALSE,\"4. omgang\"))","v":"4. omgang"},4]
[{"$f":"Data!$A$30","v":"U17 Mel"},{"$f":"IF(Data!$F$30<>\"\",Data!$F$30)","v":"11:08:00"},{"$f":"IF(B175=FALSE,IF(B174<>FALSE,\"Mål\"),IF(B174<>FALSE,\"5. omgang\"))","v":"5. omgang"},3]
[{"$f":"Data!$A$30","v":"U17 Mel"},{"$f":"IF(Data!$G$30<>\"\",Data!$G$30)","v":"11:25:00"},{"$f":"IF(B176=FALSE,IF(B175<>FALSE,\"Mål\"),IF(B175<>FALSE,\"6. omgang\"))","v":"6. omgang"},2]
[{"$f":"Data!$A$30","v":"U17 Mel"},{"$f":"IF(Data!$H$30<>\"\",Data!$H$30)","v":"11:42:00"},{"$f":"IF(B177=FALSE,IF(B176<>FALSE,\"Mål\"),IF(B176<>FALSE,\"7. omgang\"))","v":"7. omgang"},1]
[{"$f":"Data!$A$30","v":"U17 Mel"},{"$f":"IF(Data!$I$30<>\"\",Data!$I$30)","v":"11:58:00"},{"$f":"IF(B178=FALSE,IF(B177<>FALSE,\"Mål\"),IF(B177<>FALSE,\"8. omgang\"))","v":"Mål"},""]
[{"$f":"Data!$A$30","v":"U17 Mel"},{"$f":"IF(Data!$J$30<>\"\",Data!$J$30)","v":false},{"$f":"IF(B179=FALSE,IF(B178<>FALSE,\"Mål\"),IF(B178<>FALSE,\"9. omgang\"))","v":false},false]
[{"$f":"Data!$A$30","v":"U17 Mel"},{"$f":"IF(Data!$K$30<>\"\",Data!$K$30)","v":false},{"$f":"IF(B180=FALSE,IF(B179<>FALSE,\"Mål\"),IF(B179<>FALSE,\"10. omgang\"))","v":false},false]
[{"$f":"Data!$A$30","v":"U17 Mel"},{"$f":"IF(Data!$L$30<>\"\",Data!$L$30)","v":false},{"$f":"IF(B181=FALSE,IF(B180<>FALSE,\"Mål\"),IF(B180<>FALSE,\"11. omgang\"))","v":false},false]
[{"$f":"Data!$A$30","v":"U17 Mel"},{"$f":"IF(Data!$M$30<>\"\",Data!$M$30)","v":false},{"$f":"IF(B182=FALSE,IF(B181<>FALSE,\"Mål\"),IF(B181<>FALSE,\"12. omgang\"))","v":false},false]
[{"$f":"Data!$A$30","v":"U17 Mel"},{"$f":"IF(Data!$N$30<>\"\",Data!$N$30)","v":false},{"$f":"IF(B183=FALSE,IF(B182<>FALSE,\"Mål\"),IF(B182<>FALSE,\"13. omgang\"))","v":false},false]
[{"$f":"Data!$A$30","v":"U17 Mel"},{"$f":"IF(Data!$O$30<>\"\",Data!$O$30)","v":false},{"$f":"IF(B184=FALSE,IF(B183<>FALSE,\"Mål\"),IF(B183<>FALSE,\"14. omgang\"))","v":false},false]
[{"$f":"Data!$A$30","v":"U17 Mel"},{"$f":"IF(Data!$P$30<>\"\",Data!$P$30)","v":false},{"$f":"IF(B185=FALSE,IF(B184<>FALSE,\"Mål\"),IF(B184<>FALSE,\"15. omgang\"))","v":false},false]
[{"$f":"Data!$A$30","v":"U17 Mel"},{"$f":"IF(Data!$Q$30<>\"\",Data!$Q$30)","v":false},{"$f":"IF(B186=FALSE,IF(B185<>FALSE,\"Mål\"),IF(B185<>FALSE,\"16. omgang\"))","v":false},false]
[{"$f":"Data!$A$30","v":"U17 Mel"},{"$f":"IF(Data!$R$30<>\"\",Data!$R$30)","v":false},{"$f":"IF(B187=FALSE,IF(B186<>FALSE,\"Mål\"),IF(B186<>FALSE,\"17. omgang\"))","v":false},false]
[{"$f":"Data!$A$30","v":"U17 Mel"},{"$f":"IF(Data!$S$30<>\"\",Data!$S$30)","v":false},{"$f":"IF(B188=FALSE,IF(B187<>FALSE,\"Mål\"),IF(B187<>FALSE,\"18. omgang\"))","v":false},false]
[{"$f":"Data!$A$30","v":"U17 Mel"},{"$f":"IF(Data!$T$30<>\"\",Data!$T$30)","v":false},{"$f":"IF(B189=FALSE,IF(B188<>FALSE,\"Mål\"),IF(B188<>FALSE,\"19. omgang\"))","v":false},false]
[{"$f":"Data!$A$30","v":"U17 Mel"},{"$f":"IF(Data!$U$30<>\"\",Data!$U$30)","v":false},{"$f":"IF(B190=FALSE,IF(B189<>FALSE,\"Mål\"),IF(B189<>FALSE,\"20. omgang\"))","v":false},false]
[{"$f":"Data!$A$30","v":"U17 Mel"},{"$f":"IF(Data!$V$30<>\"\",Data!$V$30)","v":false},{"$f":"IF(B190=FALSE,IF(B190<>FALSE,\"Mål\"),\"Mål\")","v":false},false]
[{"$f":"Data!$A$33","v":"A Mel"},{"$f":"IF(Data!$B$33<>\"\",Data!$B$33)","v":"12:00:00"},{"$f":"IF(B192=FALSE,IF(B191<>FALSE,\"Mål\"),IF(B191<>FALSE,\"Start\"))","v":"Start"},12]
[{"$f":"Data!$A$33","v":"A Mel"},{"$f":"IF(Data!$C$33<>\"\",Data!$C$33)","v":"12:15:00"},{"$f":"IF(B193=FALSE,IF(B192<>FALSE,\"Mål\"),IF(B192<>FALSE,\"2. omgang\"))","v":"2. omgang"},11]
[{"$f":"Data!$A$33","v":"A Mel"},{"$f":"IF(Data!$D$33<>\"\",Data!$D$33)","v":"12:30:00"},{"$f":"IF(B194=FALSE,IF(B193<>FALSE,\"Mål\"),IF(B193<>FALSE,\"3. omgang\"))","v":"3. omgang"},10]
[{"$f":"Data!$A$33","v":"A Mel"},{"$f":"IF(Data!$E$33<>\"\",Data!$E$33)","v":"12:45:00"},{"$f":"IF(B195=FALSE,IF(B194<>FALSE,\"Mål\"),IF(B194<>FALSE,\"4. omgang\"))","v":"4. omgang"},{"$f":"IF(C194=\"Mål\",\"\",IF(C195=\"Mål\",1,IF(C194<>FALSE,D195+1)))","v":9}]
[{"$f":"Data!$A$33","v":"A Mel"},{"$f":"IF(Data!$F$33<>\"\",Data!$F$33)","v":"13:00:00"},{"$f":"IF(B196=FALSE,IF(B195<>FALSE,\"Mål\"),IF(B195<>FALSE,\"5. omgang\"))","v":"5. omgang"},8]
[{"$f":"Data!$A$33","v":"A Mel"},{"$f":"IF(Data!$G$33<>\"\",Data!$G$33)","v":"13:15:00"},{"$f":"IF(B197=FALSE,IF(B196<>FALSE,\"Mål\"),IF(B196<>FALSE,\"6. omgang\"))","v":"6. omgang"},7]
[{"$f":"Data!$A$33","v":"A Mel"},{"$f":"IF(Data!$H$33<>\"\",Data!$H$33)","v":"13:30:00"},{"$f":"IF(B198=FALSE,IF(B197<>FALSE,\"Mål\"),IF(B197<>FALSE,\"7. omgang\"))","v":"7. omgang"},6]
[{"$f":"Data!$A$33","v":"A Mel"},{"$f":"IF(Data!$I$33<>\"\",Data!$I$33)","v":"13:45:00"},{"$f":"IF(B199=FALSE,IF(B198<>FALSE,\"Mål\"),IF(B198<>FALSE,\"8. omgang\"))","v":"8. omgang"},5]
[{"$f":"Data!$A$33","v":"A Mel"},{"$f":"IF(Data!$J$33<>\"\",Data!$J$33)","v":"14:00:00"},{"$f":"IF(B200=FALSE,IF(B199<>FALSE,\"Mål\"),IF(B199<>FALSE,\"9. omgang\"))","v":"9. omgang"},4]
[{"$f":"Data!$A$33","v":"A Mel"},{"$f":"IF(Data!$K$33<>\"\",Data!$K$33)","v":"14:15:00"},{"$f":"IF(B201=FALSE,IF(B200<>FALSE,\"Mål\"),IF(B200<>FALSE,\"10. omgang\"))","v":"10. omgang"},3]
[{"$f":"Data!$A$33","v":"A Mel"},{"$f":"IF(Data!$L$33<>\"\",Data!$L$33)","v":"14:30:00"},{"$f":"IF(B202=FALSE,IF(B201<>FALSE,\"Mål\"),IF(B201<>FALSE,\"11. omgang\"))","v":"11. omgang"},2]
[{"$f":"Data!$A$33","v":"A Mel"},{"$f":"IF(Data!$M$33<>\"\",Data!$M$33)","v":"14:45:00"},{"$f":"IF(B203=FALSE,IF(B202<>FALSE,\"Mål\"),IF(B202<>FALSE,\"12. omgang\"))","v":"12. omgang"},1]
[{"$f":"Data!$A$33","v":"A Mel"},{"$f":"IF(Data!$N$33<>\"\",Data!$N$33)","v":"15:00:00"},{"$f":"IF(B204=FALSE,IF(B203<>FALSE,\"Mål\"),IF(B203<>FALSE,\"13. omgang\"))","v":"Mål"},""]
[{"$f":"Data!$A$33","v":"A Mel"},{"$f":"IF(Data!$O$33<>\"\",Data!$O$33)","v":false},{"$f":"IF(B205=FALSE,IF(B204<>FALSE,\"Mål\"),IF(B204<>FALSE,\"14. omgang\"))","v":false},false]
[{"$f":"Data!$A$33","v":"A Mel"},{"$f":"IF(Data!$P$33<>\"\",Data!$P$33)","v":false},{"$f":"IF(B206=FALSE,IF(B205<>FALSE,\"Mål\"),IF(B205<>FALSE,\"15. omgang\"))","v":false},false]
[{"$f":"Data!$A$33","v":"A Mel"},{"$f":"IF(Data!$Q$33<>\"\",Data!$Q$33)","v":false},{"$f":"IF(B207=FALSE,IF(B206<>FALSE,\"Mål\"),IF(B206<>FALSE,\"16. omgang\"))","v":false},false]
[{"$f":"Data!$A$33","v":"A Mel"},{"$f":"IF(Data!$R$33<>\"\",Data!$R$33)","v":false},{"$f":"IF(B208=FALSE,IF(B207<>FALSE,\"Mål\"),IF(B207<>FALSE,\"17. omgang\"))","v":false},false]
[{"$f":"Data!$A$33","v":"A Mel"},{"$f":"IF(Data!$S$33<>\"\",Data!$S$33)","v":false},{"$f":"IF(B209=FALSE,IF(B208<>FALSE,\"Mål\"),IF(B208<>FALSE,\"18. omgang\"))","v":false},false]
[{"$f":"Data!$A$33","v":"A Mel"},{"$f":"IF(Data!$T$33<>\"\",Data!$T$33)","v":false},{"$f":"IF(B210=FALSE,IF(B209<>FALSE,\"Mål\"),IF(B209<>FALSE,\"19. omgang\"))","v":false},false]
[{"$f":"Data!$A$33","v":"A Mel"},{"$f":"IF(Data!$U$33<>\"\",Data!$U$33)","v":false},{"$f":"IF(B211=FALSE,IF(B210<>FALSE,\"Mål\"),IF(B210<>FALSE,\"20. omgang\"))","v":false},false]
[{"$f":"Data!$A$33","v":"A Mel"},{"$f":"IF(Data!$V$33<>\"\",Data!$V$33)","v":false},{"$f":"IF(B211=FALSE,IF(B211<>FALSE,\"Mål\"),\"Mål\")","v":false},false]
[{"$f":"Data!$A$36","v":"U19 Mel"},{"$f":"IF(Data!$B$36<>\"\",Data!$B$36)","v":"12:07:00"},{"$f":"IF(B213=FALSE,IF(B212<>FALSE,\"Mål\"),IF(B212<>FALSE,\"Start\"))","v":"Start"},8]
[{"$f":"Data!$A$36","v":"U19 Mel"},{"$f":"IF(Data!$C$36<>\"\",Data!$C$36)","v":"12:23:00"},{"$f":"IF(B214=FALSE,IF(B213<>FALSE,\"Mål\"),IF(B213<>FALSE,\"2. omgang\"))","v":"2. omgang"},7]
[{"$f":"Data!$A$36","v":"U19 Mel"},{"$f":"IF(Data!$D$36<>\"\",Data!$D$36)","v":"12:39:00"},{"$f":"IF(B215=FALSE,IF(B214<>FALSE,\"Mål\"),IF(B214<>FALSE,\"3. omgang\"))","v":"3. omgang"},6]
[{"$f":"Data!$A$36","v":"U19 Mel"},{"$f":"IF(Data!$E$36<>\"\",Data!$E$36)","v":"12:55:00"},{"$f":"IF(B216=FALSE,IF(B215<>FALSE,\"Mål\"),IF(B215<>FALSE,\"4. omgang\"))","v":"4. omgang"},5]
[{"$f":"Data!$A$36","v":"U19 Mel"},{"$f":"IF(Data!$F$36<>\"\",Data!$F$36)","v":"13:11:00"},{"$f":"IF(B217=FALSE,IF(B216<>FALSE,\"Mål\"),IF(B216<>FALSE,\"5. omgang\"))","v":"5. omgang"},4]
[{"$f":"Data!$A$36","v":"U19 Mel"},{"$f":"IF(Data!$G$36<>\"\",Data!$G$36)","v":"13:27:00"},{"$f":"IF(B218=FALSE,IF(B217<>FALSE,\"Mål\"),IF(B217<>FALSE,\"6. omgang\"))","v":"6. omgang"},3]
[{"$f":"Data!$A$36","v":"U19 Mel"},{"$f":"IF(Data!$H$36<>\"\",Data!$H$36)","v":"13:44:00"},{"$f":"IF(B219=FALSE,IF(B218<>FALSE,\"Mål\"),IF(B218<>FALSE,\"7. omgang\"))","v":"7. omgang"},2]
[{"$f":"Data!$A$36","v":"U19 Mel"},{"$f":"IF(Data!$I$36<>\"\",Data!$I$36)","v":"14:00:00"},{"$f":"IF(B220=FALSE,IF(B219<>FALSE,\"Mål\"),IF(B219<>FALSE,\"8. omgang\"))","v":"8. omgang"},1]
[{"$f":"Data!$A$36","v":"U19 Mel"},{"$f":"IF(Data!$J$36<>\"\",Data!$J$36)","v":"14:16:00"},{"$f":"IF(B221=FALSE,IF(B220<>FALSE,\"Mål\"),IF(B220<>FALSE,\"9. omgang\"))","v":"Mål"},""]
[{"$f":"Data!$A$36","v":"U19 Mel"},{"$f":"IF(Data!$K$36<>\"\",Data!$K$36)","v":false},{"$f":"IF(B222=FALSE,IF(B221<>FALSE,\"Mål\"),IF(B221<>FALSE,\"10. omgang\"))","v":false},false]
[{"$f":"Data!$A$36","v":"U19 Mel"},{"$f":"IF(Data!$L$36<>\"\",Data!$L$36)","v":false},{"$f":"IF(B223=FALSE,IF(B222<>FALSE,\"Mål\"),IF(B222<>FALSE,\"11. omgang\"))","v":false},false]
[{"$f":"Data!$A$36","v":"U19 Mel"},{"$f":"IF(Data!$M$36<>\"\",Data!$M$36)","v":false},{"$f":"IF(B224=FALSE,IF(B223<>FALSE,\"Mål\"),IF(B223<>FALSE,\"12. omgang\"))","v":false},false]
[{"$f":"Data!$A$36","v":"U19 Mel"},{"$f":"IF(Data!$N$36<>\"\",Data!$N$36)","v":false},{"$f":"IF(B225=FALSE,IF(B224<>FALSE,\"Mål\"),IF(B224<>FALSE,\"13. omgang\"))","v":false},false]
[{"$f":"Data!$A$36","v":"U19 Mel"},{"$f":"IF(Data!$O$36<>\"\",Data!$O$36)","v":false},{"$f":"IF(B226=FALSE,IF(B225<>FALSE,\"Mål\"),IF(B225<>FALSE,\"14. omgang\"))","v":false},false]
[{"$f":"Data!$A$36","v":"U19 Mel"},{"$f":"IF(Data!$P$36<>\"\",Data!$P$36)","v":false},{"$f":"IF(B227=FALSE,IF(B226<>FALSE,\"Mål\"),IF(B226<>FALSE,\"15. omgang\"))","v":false},false]
[{"$f":"Data!$A$36","v":"U19 Mel"},{"$f":"IF(Data!$Q$36<>\"\",Data!$Q$36)","v":false},{"$f":"IF(B228=FALSE,IF(B227<>FALSE,\"Mål\"),IF(B227<>FALSE,\"16. omgang\"))","v":false},false]
[{"$f":"Data!$A$36","v":"U19 Mel"},{"$f":"IF(Data!$R$36<>\"\",Data!$R$36)","v":false},{"$f":"IF(B229=FALSE,IF(B228<>FALSE,\"Mål\"),IF(B228<>FALSE,\"17. omgang\"))","v":false},false]
[{"$f":"Data!$A$36","v":"U19 Mel"},{"$f":"IF(Data!$S$36<>\"\",Data!$S$36)","v":false},{"$f":"IF(B230=FALSE,IF(B229<>FALSE,\"Mål\"),IF(B229<>FALSE,\"18. omgang\"))","v":false},false]
[{"$f":"Data!$A$36","v":"U19 Mel"},{"$f":"IF(Data!$T$36<>\"\",Data!$T$36)","v":false},{"$f":"IF(B231=FALSE,IF(B230<>FALSE,\"Mål\"),IF(B230<>FALSE,\"19. omgang\"))","v":false},false]
[{"$f":"Data!$A$36","v":"U19 Mel"},{"$f":"IF(Data!$U$36<>\"\",Data!$U$36)","v":false},{"$f":"IF(B232=FALSE,IF(B231<>FALSE,\"Mål\"),IF(B231<>FALSE,\"20. omgang\"))","v":false},false]
[{"$f":"Data!$A$36","v":"U19 Mel"},{"$f":"IF(Data!$V$36<>\"\",Data!$V$36)","v":false},{"$f":"IF(B232=FALSE,IF(B232<>FALSE,\"Mål\"),\"Mål\")","v":false},false]
[{"$f":"Data!$A$39","v":"D Mel"},{"$f":"IF(Data!$B$39<>\"\",Data!$B$39)","v":false},{"$f":"IF(B234=FALSE,IF(B233<>FALSE,\"Mål\"),IF(B233<>FALSE,\"Start\"))","v":false},false]
[{"$f":"Data!$A$39","v":"D Mel"},{"$f":"IF(Data!$C$39<>\"\",Data!$C$39)","v":false},{"$f":"IF(B235=FALSE,IF(B234<>FALSE,\"Mål\"),IF(B234<>FALSE,\"2. omgang\"))","v":false},false]
[{"$f":"Data!$A$39","v":"D Mel"},{"$f":"IF(Data!$D$39<>\"\",Data!$D$39)","v":false},{"$f":"IF(B236=FALSE,IF(B235<>FALSE,\"Mål\"),IF(B235<>FALSE,\"3. omgang\"))","v":false},false]
[{"$f":"Data!$A$39","v":"D Mel"},{"$f":"IF(Data!$E$39<>\"\",Data!$E$39)","v":false},{"$f":"IF(B237=FALSE,IF(B236<>FALSE,\"Mål\"),IF(B236<>FALSE,\"4. omgang\"))","v":false},false]
[{"$f":"Data!$A$39","v":"D Mel"},{"$f":"IF(Data!$F$39<>\"\",Data!$F$39)","v":false},{"$f":"IF(B238=FALSE,IF(B237<>FALSE,\"Mål\"),IF(B237<>FALSE,\"5. omgang\"))","v":false},false]
[{"$f":"Data!$A$39","v":"D Mel"},{"$f":"IF(Data!$G$39<>\"\",Data!$G$39)","v":false},{"$f":"IF(B239=FALSE,IF(B238<>FALSE,\"Mål\"),IF(B238<>FALSE,\"6. omgang\"))","v":false},false]
[{"$f":"Data!$A$39","v":"D Mel"},{"$f":"IF(Data!$H$39<>\"\",Data!$H$39)","v":false},{"$f":"IF(B240=FALSE,IF(B239<>FALSE,\"Mål\"),IF(B239<>FALSE,\"7. omgang\"))","v":false},false]
[{"$f":"Data!$A$39","v":"D Mel"},{"$f":"IF(Data!$I$39<>\"\",Data!$I$39)","v":false},{"$f":"IF(B241=FALSE,IF(B240<>FALSE,\"Mål\"),IF(B240<>FALSE,\"8. omgang\"))","v":false},false]
[{"$f":"Data!$A$39","v":"D Mel"},{"$f":"IF(Data!$J$39<>\"\",Data!$J$39)","v":false},{"$f":"IF(B242=FALSE,IF(B241<>FALSE,\"Mål\"),IF(B241<>FALSE,\"9. omgang\"))","v":false},false]
[{"$f":"Data!$A$39","v":"D Mel"},{"$f":"IF(Data!$K$39<>\"\",Data!$K$39)","v":false},{"$f":"IF(B243=FALSE,IF(B242<>FALSE,\"Mål\"),IF(B242<>FALSE,\"10. omgang\"))","v":false},false]
[{"$f":"Data!$A$39","v":"D Mel"},{"$f":"IF(Data!$L$39<>\"\",Data!$L$39)","v":false},{"$f":"IF(B244=FALSE,IF(B243<>FALSE,\"Mål\"),IF(B243<>FALSE,\"11. omgang\"))","v":false},false]
[{"$f":"Data!$A$39","v":"D Mel"},{"$f":"IF(Data!$M$39<>\"\",Data!$M$39)","v":false},{"$f":"IF(B245=FALSE,IF(B244<>FALSE,\"Mål\"),IF(B244<>FALSE,\"12. omgang\"))","v":false},false]
[{"$f":"Data!$A$39","v":"D Mel"},{"$f":"IF(Data!$N$39<>\"\",Data!$N$39)","v":false},{"$f":"IF(B246=FALSE,IF(B245<>FALSE,\"Mål\"),IF(B245<>FALSE,\"13. omgang\"))","v":false},false]
[{"$f":"Data!$A$39","v":"D Mel"},{"$f":"IF(Data!$O$39<>\"\",Data!$O$39)","v":false},{"$f":"IF(B247=FALSE,IF(B246<>FALSE,\"Mål\"),IF(B246<>FALSE,\"14. omgang\"))","v":false},false]
[{"$f":"Data!$A$39","v":"D Mel"},{"$f":"IF(Data!$P$39<>\"\",Data!$P$39)","v":false},{"$f":"IF(B248=FALSE,IF(B247<>FALSE,\"Mål\"),IF(B247<>FALSE,\"15. omgang\"))","v":false},false]
[{"$f":"Data!$A$39","v":"D Mel"},{"$f":"IF(Data!$Q$39<>\"\",Data!$Q$39)","v":false},{"$f":"IF(B249=FALSE,IF(B248<>FALSE,\"Mål\"),IF(B248<>FALSE,\"16. omgang\"))","v":false},false]
[{"$f":"Data!$A$39","v":"D Mel"},{"$f":"IF(Data!$R$39<>\"\",Data!$R$39)","v":false},{"$f":"IF(B250=FALSE,IF(B249<>FALSE,\"Mål\"),IF(B249<>FALSE,\"17. omgang\"))","v":false},false]
[{"$f":"Data!$A$39","v":"D Mel"},{"$f":"IF(Data!$S$39<>\"\",Data!$S$39)","v":false},{"$f":"IF(B251=FALSE,IF(B250<>FALSE,\"Mål\"),IF(B250<>FALSE,\"18. omgang\"))","v":false},false]
[{"$f":"Data!$A$39","v":"D Mel"},{"$f":"IF(Data!$T$39<>\"\",Data!$T$39)","v":false},{"$f":"IF(B252=FALSE,IF(B251<>FALSE,\"Mål\"),IF(B251<>FALSE,\"19. omgang\"))","v":false},false]
[{"$f":"Data!$A$39","v":"D Mel"},{"$f":"IF(Data!$U$39<>\"\",Data!$U$39)","v":false},{"$f":"IF(B253=FALSE,IF(B252<>FALSE,\"Mål\"),IF(B252<>FALSE,\"20. omgang\"))","v":false},false]
[{"$f":"Data!$A$39","v":"D Mel"},{"$f":"IF(Data!$V$39<>\"\",Data!$V$39)","v":false},{"$f":"IF(B253=FALSE,IF(B253<>FALSE,\"Mål\"),\"Mål\")","v":false},false]
[{"$f":"Data!$A$42","v":"B Mel"},{"$f":"IF(Data!$B$42<>\"\",Data!$B$42)","v":false},{"$f":"IF(B255=FALSE,IF(B254<>FALSE,\"Mål\"),IF(B254<>FALSE,\"Start\"))","v":false},false]
[{"$f":"Data!$A$42","v":"B Mel"},{"$f":"IF(Data!$C$42<>\"\",Data!$C$42)","v":false},{"$f":"IF(B256=FALSE,IF(B255<>FALSE,\"Mål\"),IF(B255<>FALSE,\"2. omgang\"))","v":false},false]
[{"$f":"Data!$A$42","v":"B Mel"},{"$f":"IF(Data!$D$42<>\"\",Data!$D$42)","v":false},{"$f":"IF(B257=FALSE,IF(B256<>FALSE,\"Mål\"),IF(B256<>FALSE,\"3. omgang\"))","v":false},false]
[{"$f":"Data!$A$42","v":"B Mel"},{"$f":"IF(Data!$E$42<>\"\",Data!$E$42)","v":false},{"$f":"IF(B258=FALSE,IF(B257<>FALSE,\"Mål\"),IF(B257<>FALSE,\"4. omgang\"))","v":false},false]
[{"$f":"Data!$A$42","v":"B Mel"},{"$f":"IF(Data!$F$42<>\"\",Data!$F$42)","v":false},{"$f":"IF(B259=FALSE,IF(B258<>FALSE,\"Mål\"),IF(B258<>FALSE,\"5. omgang\"))","v":false},{"$f":"IF(C258=\"Mål\",\"\",IF(C259=\"Mål\",1,IF(C258<>FALSE,D259+1)))","v":false}]
[{"$f":"Data!$A$42","v":"B Mel"},{"$f":"IF(Data!$G$42<>\"\",Data!$G$42)","v":false},{"$f":"IF(B260=FALSE,IF(B259<>FALSE,\"Mål\"),IF(B259<>FALSE,\"6. omgang\"))","v":false},false]
[{"$f":"Data!$A$42","v":"B Mel"},{"$f":"IF(Data!$H$42<>\"\",Data!$H$42)","v":false},{"$f":"IF(B261=FALSE,IF(B260<>FALSE,\"Mål\"),IF(B260<>FALSE,\"7. omgang\"))","v":false},false]
[{"$f":"Data!$A$42","v":"B Mel"},{"$f":"IF(Data!$I$42<>\"\",Data!$I$42)","v":false},{"$f":"IF(B262=FALSE,IF(B261<>FALSE,\"Mål\"),IF(B261<>FALSE,\"8. omgang\"))","v":false},false]
[{"$f":"Data!$A$42","v":"B Mel"},{"$f":"IF(Data!$J$42<>\"\",Data!$J$42)","v":false},{"$f":"IF(B263=FALSE,IF(B262<>FALSE,\"Mål\"),IF(B262<>FALSE,\"9. omgang\"))","v":false},false]
[{"$f":"Data!$A$42","v":"B Mel"},{"$f":"IF(Data!$K$42<>\"\",Data!$K$42)","v":false},{"$f":"IF(B264=FALSE,IF(B263<>FALSE,\"Mål\"),IF(B263<>FALSE,\"10. omgang\"))","v":false},false]
[{"$f":"Data!$A$42","v":"B Mel"},{"$f":"IF(Data!$L$42<>\"\",Data!$L$42)","v":false},{"$f":"IF(B265=FALSE,IF(B264<>FALSE,\"Mål\"),IF(B264<>FALSE,\"11. omgang\"))","v":false},false]
[{"$f":"Data!$A$42","v":"B Mel"},{"$f":"IF(Data!$M$42<>\"\",Data!$M$42)","v":false},{"$f":"IF(B266=FALSE,IF(B265<>FALSE,\"Mål\"),IF(B265<>FALSE,\"12. omgang\"))","v":false},false]
[{"$f":"Data!$A$42","v":"B Mel"},{"$f":"IF(Data!$N$42<>\"\",Data!$N$42)","v":false},{"$f":"IF(B267=FALSE,IF(B266<>FALSE,\"Mål\"),IF(B266<>FALSE,\"13. omgang\"))","v":false},false]
[{"$f":"Data!$A$42","v":"B Mel"},{"$f":"IF(Data!$O$42<>\"\",Data!$O$42)","v":false},{"$f":"IF(B268=FALSE,IF(B267<>FALSE,\"Mål\"),IF(B267<>FALSE,\"14. omgang\"))","v":false},false]
[{"$f":"Data!$A$42","v":"B Mel"},{"$f":"IF(Data!$P$42<>\"\",Data!$P$42)","v":false},{"$f":"IF(B269=FALSE,IF(B268<>FALSE,\"Mål\"),IF(B268<>FALSE,\"15. omgang\"))","v":false},false]
[{"$f":"Data!$A$42","v":"B Mel"},{"$f":"IF(Data!$Q$42<>\"\",Data!$Q$42)","v":false},{"$f":"IF(B270=FALSE,IF(B269<>FALSE,\"Mål\"),IF(B269<>FALSE,\"16. omgang\"))","v":false},false]
[{"$f":"Data!$A$42","v":"B Mel"},{"$f":"IF(Data!$R$42<>\"\",Data!$R$42)","v":false},{"$f":"IF(B271=FALSE,IF(B270<>FALSE,\"Mål\"),IF(B270<>FALSE,\"17. omgang\"))","v":false},false]
[{"$f":"Data!$A$42","v":"B Mel"},{"$f":"IF(Data!$S$42<>\"\",Data!$S$42)","v":false},{"$f":"IF(B272=FALSE,IF(B271<>FALSE,\"Mål\"),IF(B271<>FALSE,\"18. omgang\"))","v":false},false]
[{"$f":"Data!$A$42","v":"B Mel"},{"$f":"IF(Data!$T$42<>\"\",Data!$T$42)","v":false},{"$f":"IF(B273=FALSE,IF(B272<>FALSE,\"Mål\"),IF(B272<>FALSE,\"19. omgang\"))","v":false},false]
[{"$f":"Data!$A$42","v":"B Mel"},{"$f":"IF(Data!$U$42<>\"\",Data!$U$42)","v":false},{"$f":"IF(B274=FALSE,IF(B273<>FALSE,\"Mål\"),IF(B273<>FALSE,\"20. omgang\"))","v":false},false]
[{"$f":"Data!$A$42","v":"B Mel"},{"$f":"IF(Data!$V$42<>\"\",Data!$V$42)","v":false},{"$f":"IF(B274=FALSE,IF(B274<>FALSE,\"Mål\"),\"Mål\")","v":false},false]
[{"$f":"Data!$A$45","v":"C Mel"},{"$f":"IF(Data!$B$45<>\"\",Data!$B$45)","v":false},{"$f":"IF(B276=FALSE,IF(B275<>FALSE,\"Mål\"),IF(B275<>FALSE,\"Start\"))","v":false},false]
[{"$f":"Data!$A$45","v":"C Mel"},{"$f":"IF(Data!$C$45<>\"\",Data!$C$45)","v":false},{"$f":"IF(B277=FALSE,IF(B276<>FALSE,\"Mål\"),IF(B276<>FALSE,\"2. omgang\"))","v":false},false]
[{"$f":"Data!$A$45","v":"C Mel"},{"$f":"IF(Data!$D$45<>\"\",Data!$D$45)","v":false},{"$f":"IF(B278=FALSE,IF(B277<>FALSE,\"Mål\"),IF(B277<>FALSE,\"3. omgang\"))","v":false},false]
[{"$f":"Data!$A$45","v":"C Mel"},{"$f":"IF(Data!$E$45<>\"\",Data!$E$45)","v":false},{"$f":"IF(B279=FALSE,IF(B278<>FALSE,\"Mål\"),IF(B278<>FALSE,\"4. omgang\"))","v":false},false]
[{"$f":"Data!$A$45","v":"C Mel"},{"$f":"IF(Data!$F$45<>\"\",Data!$F$45)","v":false},{"$f":"IF(B280=FALSE,IF(B279<>FALSE,\"Mål\"),IF(B279<>FALSE,\"5. omgang\"))","v":false},false]
[{"$f":"Data!$A$45","v":"C Mel"},{"$f":"IF(Data!$G$45<>\"\",Data!$G$45)","v":false},{"$f":"IF(B281=FALSE,IF(B280<>FALSE,\"Mål\"),IF(B280<>FALSE,\"6. omgang\"))","v":false},false]
[{"$f":"Data!$A$45","v":"C Mel"},{"$f":"IF(Data!$H$45<>\"\",Data!$H$45)","v":false},{"$f":"IF(B282=FALSE,IF(B281<>FALSE,\"Mål\"),IF(B281<>FALSE,\"7. omgang\"))","v":false},false]
[{"$f":"Data!$A$45","v":"C Mel"},{"$f":"IF(Data!$I$45<>\"\",Data!$I$45)","v":false},{"$f":"IF(B283=FALSE,IF(B282<>FALSE,\"Mål\"),IF(B282<>FALSE,\"8. omgang\"))","v":false},false]
[{"$f":"Data!$A$45","v":"C Mel"},{"$f":"IF(Data!$J$45<>\"\",Data!$J$45)","v":false},{"$f":"IF(B284=FALSE,IF(B283<>FALSE,\"Mål\"),IF(B283<>FALSE,\"9. omgang\"))","v":false},false]
[{"$f":"Data!$A$45","v":"C Mel"},{"$f":"IF(Data!$K$45<>\"\",Data!$K$45)","v":false},{"$f":"IF(B285=FALSE,IF(B284<>FALSE,\"Mål\"),IF(B284<>FALSE,\"10. omgang\"))","v":false},false]
[{"$f":"Data!$A$45","v":"C Mel"},{"$f":"IF(Data!$L$45<>\"\",Data!$L$45)","v":false},{"$f":"IF(B286=FALSE,IF(B285<>FALSE,\"Mål\"),IF(B285<>FALSE,\"11. omgang\"))","v":false},false]
[{"$f":"Data!$A$45","v":"C Mel"},{"$f":"IF(Data!$M$45<>\"\",Data!$M$45)","v":false},{"$f":"IF(B287=FALSE,IF(B286<>FALSE,\"Mål\"),IF(B286<>FALSE,\"12. omgang\"))","v":false},false]
[{"$f":"Data!$A$45","v":"C Mel"},{"$f":"IF(Data!$N$45<>\"\",Data!$N$45)","v":false},{"$f":"IF(B288=FALSE,IF(B287<>FALSE,\"Mål\"),IF(B287<>FALSE,\"13. omgang\"))","v":false},false]
[{"$f":"Data!$A$45","v":"C Mel"},{"$f":"IF(Data!$O$45<>\"\",Data!$O$45)","v":false},{"$f":"IF(B289=FALSE,IF(B288<>FALSE,\"Mål\"),IF(B288<>FALSE,\"14. omgang\"))","v":false},false]
[{"$f":"Data!$A$45","v":"C Mel"},{"$f":"IF(Data!$P$45<>\"\",Data!$P$45)","v":false},{"$f":"IF(B290=FALSE,IF(B289<>FALSE,\"Mål\"),IF(B289<>FALSE,\"15. omgang\"))","v":false},false]
[{"$f":"Data!$A$45","v":"C Mel"},{"$f":"IF(Data!$Q$45<>\"\",Data!$Q$45)","v":false},{"$f":"IF(B291=FALSE,IF(B290<>FALSE,\"Mål\"),IF(B290<>FALSE,\"16. omgang\"))","v":false},false]
[{"$f":"Data!$A$45","v":"C Mel"},{"$f":"IF(Data!$R$45<>\"\",Data!$R$45)","v":false},{"$f":"IF(B292=FALSE,IF(B291<>FALSE,\"Mål\"),IF(B291<>FALSE,\"17. omgang\"))","v":false},false]
[{"$f":"Data!$A$45","v":"C Mel"},{"$f":"IF(Data!$S$45<>\"\",Data!$S$45)","v":false},{"$f":"IF(B293=FALSE,IF(B292<>FALSE,\"Mål\"),IF(B292<>FALSE,\"18. omgang\"))","v":false},false]
[{"$f":"Data!$A$45","v":"C Mel"},{"$f":"IF(Data!$T$45<>\"\",Data!$T$45)","v":false},{"$f":"IF(B294=FALSE,IF(B293<>FALSE,\"Mål\"),IF(B293<>FALSE,\"19. omgang\"))","v":false},false]
[{"$f":"Data!$A$45","v":"C Mel"},{"$f":"IF(Data!$U$45<>\"\",Data!$U$45)","v":false},{"$f":"IF(B295=FALSE,IF(B294<>FALSE,\"Mål\"),IF(B294<>FALSE,\"20. omgang\"))","v":false},false]
[{"$f":"Data!$A$45","v":"C Mel"},{"$f":"IF(Data!$V$45<>\"\",Data!$V$45)","v":false},{"$f":"IF(B295=FALSE,IF(B295<>FALSE,\"Mål\"),\"Mål\")","v":false},false]
[{"$f":"Data!$A$48","v":0},{"$f":"IF(Data!$B$48<>\"\",Data!$B$48)","v":false},{"$f":"IF(B297=FALSE,IF(B296<>FALSE,\"Mål\"),IF(B296<>FALSE,\"Start\"))","v":false},false]
[{"$f":"Data!$A$48","v":0},{"$f":"IF(Data!$C$48<>\"\",Data!$C$48)","v":false},{"$f":"IF(B298=FALSE,IF(B297<>FALSE,\"Mål\"),IF(B297<>FALSE,\"2. omgang\"))","v":false},false]
[{"$f":"Data!$A$48","v":0},{"$f":"IF(Data!$D$48<>\"\",Data!$D$48)","v":false},{"$f":"IF(B299=FALSE,IF(B298<>FALSE,\"Mål\"),IF(B298<>FALSE,\"3. omgang\"))","v":false},false]
[{"$f":"Data!$A$48","v":0},{"$f":"IF(Data!$E$48<>\"\",Data!$E$48)","v":false},{"$f":"IF(B300=FALSE,IF(B299<>FALSE,\"Mål\"),IF(B299<>FALSE,\"4. omgang\"))","v":false},false]
[{"$f":"Data!$A$48","v":0},{"$f":"IF(Data!$F$48<>\"\",Data!$F$48)","v":false},{"$f":"IF(B301=FALSE,IF(B300<>FALSE,\"Mål\"),IF(B300<>FALSE,\"5. omgang\"))","v":false},false]
[{"$f":"Data!$A$48","v":0},{"$f":"IF(Data!$G$48<>\"\",Data!$G$48)","v":false},{"$f":"IF(B302=FALSE,IF(B301<>FALSE,\"Mål\"),IF(B301<>FALSE,\"6. omgang\"))","v":false},false]
[{"$f":"Data!$A$48","v":0},{"$f":"IF(Data!$H$48<>\"\",Data!$H$48)","v":false},{"$f":"IF(B303=FALSE,IF(B302<>FALSE,\"Mål\"),IF(B302<>FALSE,\"7. omgang\"))","v":false},false]
[{"$f":"Data!$A$48","v":0},{"$f":"IF(Data!$I$48<>\"\",Data!$I$48)","v":false},{"$f":"IF(B304=FALSE,IF(B303<>FALSE,\"Mål\"),IF(B303<>FALSE,\"8. omgang\"))","v":false},false]
[{"$f":"Data!$A$48","v":0},{"$f":"IF(Data!$J$48<>\"\",Data!$J$48)","v":false},{"$f":"IF(B305=FALSE,IF(B304<>FALSE,\"Mål\"),IF(B304<>FALSE,\"9. omgang\"))","v":false},false]
[{"$f":"Data!$A$48","v":0},{"$f":"IF(Data!$K$48<>\"\",Data!$K$48)","v":false},{"$f":"IF(B306=FALSE,IF(B305<>FALSE,\"Mål\"),IF(B305<>FALSE,\"10. omgang\"))","v":false},false]
[{"$f":"Data!$A$48","v":0},{"$f":"IF(Data!$L$48<>\"\",Data!$L$48)","v":false},{"$f":"IF(B307=FALSE,IF(B306<>FALSE,\"Mål\"),IF(B306<>FALSE,\"11. omgang\"))","v":false},false]
[{"$f":"Data!$A$48","v":0},{"$f":"IF(Data!$M$48<>\"\",Data!$M$48)","v":false},{"$f":"IF(B308=FALSE,IF(B307<>FALSE,\"Mål\"),IF(B307<>FALSE,\"12. omgang\"))","v":false},false]
[{"$f":"Data!$A$48","v":0},{"$f":"IF(Data!$N$48<>\"\",Data!$N$48)","v":false},{"$f":"IF(B309=FALSE,IF(B308<>FALSE,\"Mål\"),IF(B308<>FALSE,\"13. omgang\"))","v":false},false]
[{"$f":"Data!$A$48","v":0},{"$f":"IF(Data!$O$48<>\"\",Data!$O$48)","v":false},{"$f":"IF(B310=FALSE,IF(B309<>FALSE,\"Mål\"),IF(B309<>FALSE,\"14. omgang\"))","v":false},false]
[{"$f":"Data!$A$48","v":0},{"$f":"IF(Data!$P$48<>\"\",Data!$P$48)","v":false},{"$f":"IF(B311=FALSE,IF(B310<>FALSE,\"Mål\"),IF(B310<>FALSE,\"15. omgang\"))","v":false},false]
[{"$f":"Data!$A$48","v":0},{"$f":"IF(Data!$Q$48<>\"\",Data!$Q$48)","v":false},{"$f":"IF(B312=FALSE,IF(B311<>FALSE,\"Mål\"),IF(B311<>FALSE,\"16. omgang\"))","v":false},false]
[{"$f":"Data!$A$48","v":0},{"$f":"IF(Data!$R$48<>\"\",Data!$R$48)","v":false},{"$f":"IF(B313=FALSE,IF(B312<>FALSE,\"Mål\"),IF(B312<>FALSE,\"17. omgang\"))","v":false},false]
[{"$f":"Data!$A$48","v":0},{"$f":"IF(Data!$S$48<>\"\",Data!$S$48)","v":false},{"$f":"IF(B314=FALSE,IF(B313<>FALSE,\"Mål\"),IF(B313<>FALSE,\"18. omgang\"))","v":false},false]
[{"$f":"Data!$A$48","v":0},{"$f":"IF(Data!$T$48<>\"\",Data!$T$48)","v":false},{"$f":"IF(B315=FALSE,IF(B314<>FALSE,\"Mål\"),IF(B314<>FALSE,\"19. omgang\"))","v":false},false]
[{"$f":"Data!$A$48","v":0},{"$f":"IF(Data!$U$48<>\"\",Data!$U$48)","v":false},{"$f":"IF(B316=FALSE,IF(B315<>FALSE,\"Mål\"),IF(B315<>FALSE,\"20. omgang\"))","v":false},false]
[{"$f":"Data!$A$48","v":0},{"$f":"IF(Data!$V$48<>\"\",Data!$V$48)","v":false},{"$f":"IF(B316=FALSE,IF(B316<>FALSE,\"Mål\"),\"Mål\")","v":false}]
[{"$f":"IF(C317=\"x\",\"\")","v":false}]